program: Gaussian 09
title: 000259713
version: EM64L-G09RevD.01
frameworkgroup: C1[X(C10H14O6S)]
method: RPBEPBE
basis: SDD
operation: Freq
keyword: #p
keyword: freq=noraman
keyword: PBEPBE/SDD
title: #p freq=noraman PBEPBE/SDD
converged: YES YES NO NO
title: Mulliken charges:
elementType: S O O O O O O C C C C C C C C C C H H H H H H H H H H H H H H
charge: 0.078631 -0.227984 -0.297467 -0.241685 -0.455382 -0.184159 -0.182547 -0.177082 -0.167714 -0.075240 -0.097906 -0.095011 0.361856 -0.320202 -0.676571 -0.684551 -0.112928 0.251161 0.262432 0.259981 0.258422 0.291430 0.227156 0.262743 0.250565 0.226695 0.221972 0.234476 0.221151 0.230119 0.357638
chargesum: 0.00000
title: Mulliken charges with hydrogens summed into heavy atoms:
elementType: S O O O O O O C C C C C C C C C C
charge: 0.078631 -0.227984 -0.297467 -0.241685 -0.097743 -0.184159 -0.182547 0.074079 0.094718 0.184741 0.160516 0.196419 0.361856 0.169697 0.022662 0.001195 -0.112928
polarizability: 1.79227072e+02 -1.73979832e+01 1.43262409e+02 -3.34643220e-01 -1.05751053e-01 1.00324825e+02
1716.lowfreq: -6.5906 0.0010 0.0018 0.0019 5.6344 17.0269 25.9097 41.6017 53.0366
frequency: 25.8096 41.5168 53.0218 62.8460 78.8655 88.5098 144.7543 165.2538 166.2508 209.2481 220.9936 237.3800 291.6500 293.3931 311.2683 332.8478 351.3005 379.5467 415.8069 432.0557 494.7032 510.1002 535.4714 569.2602 604.0818 634.2793 695.3744 723.3885 736.1767 754.5750 798.8004 817.2548 835.4736 853.3679 877.0573 884.8322 918.5679 923.1268 938.8440 944.2117 960.6334 983.2865 1000.1257 1004.4328 1029.9357 1040.3693 1050.6711 1072.1232 1135.4356 1137.9516 1161.9278 1174.8114 1208.5242 1219.6964 1236.2070 1242.9451 1253.1186 1264.4639 1275.9778 1280.2647 1291.2164 1299.5927 1325.0194 1330.5942 1366.7302 1374.0035 1381.7685 1394.1066 1446.9806 1454.0980 1466.3056 1476.7473 1477.8149 3001.9789 3005.3391 3005.9883 3019.2429 3026.5687 3035.9584 3091.6205 3101.3114 3109.8381 3110.4237 3112.7886 3117.2738 3143.1678 3573.5113
redmass: 6.3736 5.3456 4.3448 5.1603 5.8301 7.5590 3.3172 1.0478 4.5192 4.7183 1.2015 4.6677 1.8829 3.4553 1.7428 4.2440 3.0911 5.8809 3.3660 4.3383 4.8644 5.3585 7.3547 12.0234 5.7046 5.1833 4.9396 7.1604 4.1266 6.0634 11.6617 5.1391 4.2533 3.6481 3.0769 4.0123 7.3038 1.5096 2.9214 2.2314 3.9946 1.3130 6.0023 6.5491 3.9747 3.2995 2.0932 2.8087 1.7310 1.9035 1.2049 1.2793 2.1152 2.0653 4.3390 2.5873 1.4747 1.3939 1.4468 1.3019 1.4455 1.3980 1.1769 1.2432 1.5014 1.6344 1.2874 1.2181 1.0496 1.0491 1.0558 1.0558 1.0882 1.0357 1.0746 1.0438 1.0866 1.0860 1.0671 1.0875 1.1000 1.0994 1.0902 1.1005 1.1005 1.1030 1.0666
irintensity: 1.3473 0.5025 1.3864 2.1127 3.4297 0.6709 5.3370 0.0151 1.1673 1.7969 0.2810 0.1671 31.7495 30.8814 86.7677 7.5177 13.3188 3.8277 5.2052 4.5996 21.6719 4.7708 5.0847 2.0809 14.1254 4.9674 4.8461 12.2074 41.7501 26.8663 17.7614 28.9849 16.8724 8.2392 17.6573 144.9011 180.2327 2.2954 151.5879 13.9201 39.5125 0.3227 308.0547 30.3319 84.8095 22.8020 20.6096 28.6488 39.2532 53.2340 11.7963 22.5370 46.3734 47.9402 564.9953 21.6295 3.0269 27.4387 46.9975 4.5518 2.5082 2.3712 9.3432 5.4626 3.3510 10.6846 39.1502 25.2772 0.8761 4.4958 6.8122 15.1991 7.0260 9.0510 7.6770 8.8805 47.8388 13.1390 43.3483 5.5364 1.4223 26.7432 15.5489 20.4066 27.2547 9.1624 15.3437
temp: 298.150 k
press: 1.00000 atm
elementType: 16 8 8 8 8 8 8 6 6 6 6 6 6 6 6 6 6 1 1 1 1 1 1 1 1 1 1 1 1 1 1
symmnumber: 1
zpe: 619810.1 jmol-1
zpe.correction: 0.236073 hartree
zpe.thermalcorrener: 0.252887 hartree
zpe.thermalcorrenthalpy: 0.253831 hartree
zpe.thermalcorrgfe: 0.189975 hartree
zpe.sumelectzpe: -1237.496644 hartree
zpe.sumelectthermal: -1237.479830 hartree
zpe.sumelectthermalent: -1237.478885 hartree
zpe.sumelectthermalfe: -1237.542741 hartree
dipole: -6.7326 5.3920 -2.5086
dipole: 8.9830
quadrupole: -127.7752 -96.5381 -110.5504
quadrupole: 7.5859 2.5933 2.9321
quadrupole: -16.1539 15.0831 1.0708 7.5859 2.5933 2.9321
hfenergy: -1237.7327167 hartree
pointgroup: C01 [X(C10H14O6S1)]
dipole: 2.4550744 -2.4541912 -0.6633187 debye
polarizability: 175.099357|-20.3031161|146.6936222|5.3931417|-5.0219768|101.0213266 unknown
InChI: InChI=1S/C10H14O6S/c1-10(2)15-7-5(11)6(14-8(7)16-10)4-3-12-9(17)13-4/h4-8,11H,3H2,1-2H3
charge 0 multiplicity 1
31 atoms
S  -4.698174 2.216864 -0.4724
O  0.397212 0.238782 1.227672
O  2.577744 -0.475044 -0.950882
O  2.82533 0.594954 1.151453
O  -0.229918 -2.627211 0.258649
O  -2.427755 0.970333 0.357518
O  -3.826743 -0.31772 -0.925265
C  1.86192 -1.283779 0.049401
C  0.417107 -1.507769 -0.441488
C  -0.300602 -0.209113 -0.002121
C  1.742827 -0.355484 1.289051
C  -1.780269 -0.388754 0.338119
C  3.183369 0.73296 -0.285647
C  -2.612361 -1.161961 -0.716716
C  2.562795 1.996239 -0.887021
C  4.704793 0.663859 -0.396849
C  -3.635421 0.941172 -0.343381
H  2.406019 -2.225032 0.249601
H  0.399177 -1.649842 -1.538562
H  -0.1969 0.557289 -0.794852
H  1.853287 -0.80853 2.284003
H  -1.878701 -0.81019 1.349649
H  -2.106607 -1.25806 -1.692775
H  -2.940289 -2.145127 -0.35683
H  1.484752 2.047267 -0.666128
H  3.042246 2.889567 -0.45177
H  2.715239 2.00893 -1.979964
H  5.073336 -0.293641 0.005783
H  5.012422 0.751716 -1.452646
H  5.16076 1.489107 0.176334
H  0.199907 -3.479582 -0.002834
