program: Gaussian 09
title: 000253220
version: EM64L-G09RevD.01
frameworkgroup: C1[X(C7H9NO)]
method: RPBEPBE
basis: SDD
operation: Freq
keyword: #pfreq=noraman
keyword: PBEPBE/SDD
title: #p freq=noraman PBEPBE/SDD
converged: NO NO NO NO
title: Mulliken charges:
elementType: O N C C C C C C C H H H H H H H H H
charge: -0.289591 -0.021224 0.082872 -0.306098 -0.328976 -0.174646 -0.182051 -0.361008 -0.490229 0.219797 0.219643 0.284520 0.236864 0.228664 0.238139 0.204748 0.204785 0.233789
chargesum: 0.00000
title: Mulliken charges with hydrogens summed into heavy atoms:
elementType: O N C C C C C C C
charge: -0.289591 -0.021224 0.082872 0.133342 -0.044456 0.062219 0.046613 -0.122869 0.153093
polarizability: 1.14022482e+02 4.05441064e-01 8.42342690e+01 1.27941268e-02 3.39124051e-03 4.42389914e+01
1716.lowfreq: -0.0007 -0.0001 0.0009 5.8847 6.2453 25.4871 65.7177 78.5866 146.7441
frequency: 65.7164 78.5436 146.7430 192.8053 216.7297 323.9227 390.3383 404.2722 466.7667 598.7916 624.0292 742.8142 763.6603 819.3238 905.7907 908.5454 955.0784 966.2747 1004.8737 1016.8008 1037.3214 1068.6600 1086.5571 1117.7290 1153.0662 1161.8604 1190.0338 1242.3173 1279.3996 1318.2343 1364.3925 1413.7101 1437.6179 1454.8238 1458.1131 1461.1905 1478.1054 1565.3914 1585.3085 2922.7523 2930.7961 2974.2407 3001.0330 3102.1161 3125.2838 3137.6063 3162.3125 3184.7707
redmass: 2.7886 2.4082 3.7038 2.8977 1.2283 3.7795 5.3520 3.4152 2.6723 6.0170 6.0566 3.6086 1.1831 4.0828 5.7256 1.2666 1.4329 6.9902 1.4236 1.6235 2.2883 4.3681 1.8065 1.2741 1.4404 1.1112 1.0817 2.4536 1.5277 7.1308 1.4941 1.8991 1.1541 1.4221 1.0507 1.5331 1.0784 6.0036 5.8556 1.0441 1.0450 1.1042 1.1030 1.0972 1.0875 1.0909 1.0985 1.0962
irintensity: 0.2447 14.7567 6.9510 1.1129 6.9036 0.5426 0.7378 4.1439 5.2529 2.8009 1.3637 2.1014 79.9987 1.1818 20.6169 0.2003 0.4793 1.0780 0.0054 1.7355 10.3711 101.9954 32.1123 0.0103 21.5095 3.3437 4.1513 1.1109 0.3970 3.3756 15.6543 24.7568 0.3329 52.0989 12.6613 2.1915 9.1715 10.6571 47.0896 49.5823 82.4376 45.9417 69.6952 29.5332 8.4118 20.0635 29.6267 3.4862
temp: 298.150 k
press: 1.00000 atm
elementType: 8 7 6 6 6 6 6 6 6 1 1 1 1 1 1 1 1 1
symmnumber: 1
zpe: 382844.3 jmol-1
zpe.correction: 0.145818 hartree
zpe.thermalcorrener: 0.154334 hartree
zpe.thermalcorrenthalpy: 0.155279 hartree
zpe.thermalcorrgfe: 0.111917 hartree
zpe.sumelectzpe: -401.415260 hartree
zpe.sumelectthermal: -401.406743 hartree
zpe.sumelectthermalent: -401.405799 hartree
zpe.sumelectthermalfe: -401.449160 hartree
dipole: -0.6122 0.7653 0.0058
dipole: 0.9801
quadrupole: -38.7466 -53.7262 -55.9137
quadrupole: 4.1041 -0.0110 0.0017
quadrupole: 10.7156 -4.2640 -6.4515 4.1041 -0.0110 0.0017
hfenergy: -401.5610774 hartree
pointgroup: C01 [X(C7H9N1O1)]
dipole: 0.2157876 -0.2785685 0.1565741 debye
dipolederiv: -1.1102976 0.1412986 -0.0396368 0.258694 -0.4597268 -0.0042886 -0.1105232 0.0034666 -0.4324022 -0.5565506 -0.0127298 0.0296785 0.0745824 -0.3018325 0.0351386 -0.0231248 0.0410599 -0.2588857 0.6624476 0.0222693 -0.0587733 0.2398328 0.074479 -0.0605674 -0.190138 -0.0453051 0.0425704 0.3321955 -0.1408971 0.0906601 -0.4554249 0.4385298 0.0155684 0.2801986 -0.0057251 0.3975444 -0.2915796 -0.0648453 0.052027 -0.2479056 -0.0925578 0.0093922 0.1625726 -0.0033338 -0.1147419 0.1647589 0.0241528 -0.0349116 0.0140351 0.1076798 -0.1426813 -0.0286286 -0.1433683 -0.0375055 0.0049616 -0.0147357 -0.0003203 0.1129982 -0.2271558 0.0525353 -0.077556 0.061543 -0.1593487 0.1916496 -0.0193174 -0.0073774 -0.1883264 0.213578 -0.1673085 0.0950142 -0.1791279 0.0179993 0.825331 -0.0319845 -0.0107214 0.071648 0.2708385 0.0632859 -0.0728306 0.0702852 0.346183 -0.035552 0.0136628 0.0613762 0.0834922 0.0392485 0.0039807 0.0071734 0.0483468 -0.1628857 -0.0491275 -0.0627459 -0.03687 0.0219335 -0.1388732 -0.0465321 -0.0759069 -0.0804968 0.0286 0.1181425 0.0628169 -0.0346043 0.0895282 0.0558985 0.0607435 -0.050905 0.0625263 0.1319888 0.0523151 -0.0579425 0.0415731 -0.0680998 -0.0150712 0.1020374 0.0477694 0.1012675 0.0809377 -0.1267844 -0.0048904 0.0233836 -0.016452 0.114717 0.0329679 0.0303158 0.0321767 0.1456463 -0.0238195 0.0888091 -0.0429125 0.1124125 0.0009648 0.0725961 -0.0571991 0.0742276 0.0925556 -0.0766994 -0.0285247 -0.0250717 -0.1774522 -0.1241238 -0.1215762 -0.0271045 -0.1038444 0.0221991 -0.0603268 0.0162785 0.0252547 -0.0488805 0.0858308 0.0087422 0.1563561 -0.0233709 -0.2043142 -0.0210644 0.0693254 -0.032754 0.1233845 -0.0424233 0.0859659 -0.0654833 0.0896726 0.0638596 unknown
polarizability: 113.6536723|-3.8135778|73.7519625|-2.4919734|-17.6212971|55.090108 unknown
InChI: InChI=1S/C7H9NO/c1-9-6-7-4-2-3-5-8-7/h2-5H,6H2,1H3
charge 0 multiplicity 1
18 atoms
O  2.28278 -0.680561 0.145413
N  -0.765842 1.15665 -0.756025
C  0.050832 0.192651 -0.228494
C  1.530926 0.415531 -0.465232
C  -0.440358 -0.927067 0.483934
C  -1.837628 -1.054893 0.658716
C  -2.693919 -0.066517 0.119508
C  -2.110264 1.017311 -0.57808
C  3.723262 -0.5298 -0.041694
H  1.723143 0.466314 -1.55984
H  1.828852 1.393084 -0.025572
H  0.267997 -1.659396 0.878069
H  -2.250146 -1.910291 1.205451
H  -3.781134 -0.129977 0.233456
H  -2.732928 1.807508 -1.013926
H  4.101228 0.40466 0.426062
H  3.998455 -0.528022 -1.118342
H  4.190343 -1.397183 0.450995
