program: Gaussian 09
title: 000253219
version: EM64L-G09RevD.01
frameworkgroup: C1[X(C6H6N2O3)]
method: RPBEPBE
basis: SDD
operation: Freq
keyword: #pfreq=noraman
keyword: PBEPBE/SDD
title: #p freq=noraman PBEPBE/SDD
converged: NO YES NO YES
title: Mulliken charges:
elementType: O O O N N C C C C C C H H H H H H
charge: -0.215034 -0.223896 -0.172481 -0.055461 0.028420 0.211206 0.133481 -0.237262 -0.179137 -0.314190 -0.501683 0.300299 0.245312 0.251783 0.242768 0.242768 0.243107
chargesum: 0.00000
title: Mulliken charges with hydrogens summed into heavy atoms:
elementType: O O O N N C C C C C C
charge: -0.215034 -0.223896 -0.172481 -0.055461 0.028420 0.211206 0.133481 0.063037 0.066175 -0.062407 0.226960
polarizability: 1.17750373e+02 1.29687501e+00 1.20317064e+02 -2.99713246e-03 1.69942369e-03 3.95739033e+01
1716.lowfreq: -19.7604 -10.3775 -8.4104 -0.0009 -0.0006 -0.0003 7.6732 104.5080 126.0909
frequency: -19.6302 104.5074 126.0904 156.5584 184.4374 262.8177 264.3081 365.6657 388.4656 436.2220 529.8890 531.3537 604.9552 642.2532 679.6712 749.6867 756.7815 815.5882 827.9203 948.6028 956.7046 992.7077 1022.8954 1062.8924 1108.4368 1132.1472 1149.7018 1191.2168 1225.8105 1276.7228 1336.9674 1362.7874 1404.8050 1417.9103 1450.7936 1454.1044 1459.6099 1551.7302 1580.2460 3011.2462 3117.7769 3143.6128 3154.9619 3174.4428 3191.8802
redmass: 11.7465 3.8599 3.1065 1.1969 5.0238 5.3517 4.7818 10.0424 7.1851 5.0377 3.2173 8.3366 5.5027 8.2420 8.3201 9.6050 4.4260 1.4519 7.0734 8.0779 1.3993 1.3584 5.8970 2.0438 1.2511 1.5256 1.4189 7.5559 1.8869 3.6642 6.1840 6.4366 1.7812 1.8554 1.0517 1.8709 1.0633 6.7607 6.9459 1.0287 1.1048 1.0905 1.1056 1.0909 1.0994
irintensity: 0.0022 1.6648 8.9731 0.3573 1.9244 1.6383 9.7609 0.3055 2.6648 2.2399 3.1822 4.6576 3.3056 6.2936 3.7399 17.9308 37.5857 38.5491 24.6735 48.3920 0.0052 2.3281 3.8142 15.5481 0.0991 14.5926 25.1105 264.2833 43.2237 98.6493 44.0728 38.2813 102.4658 8.8252 15.0063 133.7888 14.6909 97.6529 114.1254 39.4039 23.6465 14.1930 13.9097 4.7087 9.6162
temp: 298.150 k
press: 1.00000 atm
elementType: 8 8 8 7 7 6 6 6 6 6 6 1 1 1 1 1 1
symmnumber: 1
zpe: 312870.6 jmol-1
zpe.correction: 0.119166 hartree
zpe.thermalcorrener: 0.128014 hartree
zpe.thermalcorrenthalpy: 0.128959 hartree
zpe.thermalcorrgfe: 0.084915 hartree
zpe.sumelectzpe: -566.496847 hartree
zpe.sumelectthermal: -566.487998 hartree
zpe.sumelectthermalent: -566.487054 hartree
zpe.sumelectthermalfe: -566.531098 hartree
dipole: -4.2331 3.2871 0.0002
dipole: 5.3595
quadrupole: -67.8354 -55.9048 -62.8740
quadrupole: 7.9476 0.0006 0.0002
quadrupole: -5.6307 6.3000 -0.6693 7.9476 0.0006 0.0002
hfenergy: -566.6160129 hartree
pointgroup: C01 [X(C6H6N2O3)]
dipole: 2.0134675 0.626215 -0.000089 debye
dipolederiv: -0.2833973 0.0819584 0.0000006 0.4688293 -1.5543858 0.0000098 -0.0000119 0.0000247 -0.2799184 -0.852989 0.2311546 0.0000403 0.2203673 -0.6028522 -0.0000278 0.0000398 -0.0000256 -0.2441724 -0.5394726 -0.1723209 0.0000123 -0.1697934 -0.6428788 -0.0000147 0.0000222 -0.0000103 -0.2022074 -0.3045583 -0.4976943 0.0000156 0.1333991 -0.7924063 0.0000075 0.000002 0.0000341 -0.2226378 1.7251991 -0.0270088 -0.0000804 0.1454463 1.042874 0.0000426 -0.0000921 0.0000377 0.1941826 -0.662739 0.1683188 0.0000261 -0.3703334 -0.4015206 0.0000153 0.0000335 -0.000003 0.0345377 0.1816075 0.2964171 -0.000007 -0.3198286 1.563672 -0.0000198 -0.0000013 -0.0000447 0.2095658 0.3032346 0.0356878 -0.0000153 0.4194109 0.1768356 -0.0000218 -0.0000108 -0.0000023 -0.056431 -0.6587622 0.0097833 0.0000208 0.161341 -0.0195254 -0.000007 0.0000254 -0.0000009 -0.1584991 0.5118844 0.1329741 -0.0000268 -0.3376775 0.4700349 0.0000037 -0.0000186 -0.0000158 -0.0424374 0.4159418 -0.3369127 0.0000022 -0.2359674 0.6763112 0.0000002 0.0000042 0.0000041 0.2670903 0.1006365 0.0685139 0.0000009 0.0265087 0.1161995 0.0000004 -0.0000008 -0.0000055 0.1651143 0.0811385 -0.026452 0.000004 -0.0456437 -0.0688117 0.0000056 0.0000027 0.0000051 0.1749519 -0.0613697 -0.0916831 0.0000104 -0.0573216 0.0541348 0.000004 0.0000069 0.0000053 0.1370087 -0.0105997 0.1102092 -0.0784712 -0.0110636 0.0454582 -0.0582768 -0.0929316 -0.0078072 -0.0510757 -0.0105879 0.1102114 0.078464 -0.0110545 0.0454622 0.0582737 0.0929281 0.0077963 -0.0510886 0.0648331 -0.0931567 0.0000035 -0.0166189 -0.1086018 0.0000052 0.0000021 0.000008 0.1260166 unknown
polarizability: 117.2140856|-0.1333998|120.8533517|-0.003403|-0.000539|39.5739033 unknown
InChI: InChI=1S/C6H6N2O3/c1-11-6-5(8(9)10)3-2-4-7-6/h2-4H,1H3
charge 0 multiplicity 1
17 atoms
O  0.400181 -1.864555 0.000028
O  -2.837575 0.895133 0.000175
O  -2.217124 -1.297382 0.000058
N  1.876815 -0.042786 -0.00007
N  -1.938752 -0.041672 0.000091
C  -0.519758 0.390377 0.000022
C  0.59786 -0.510025 -0.000009
C  -0.270052 1.77971 -0.000007
C  1.05676 2.252286 -0.000068
C  2.098585 1.297866 -0.0001
C  1.61178 -2.724427 0.000004
H  -1.13021 2.45444 0.000022
H  1.27787 3.322227 -0.000092
H  3.149633 1.607259 -0.000153
H  2.220357 -2.532257 0.898414
H  2.220297 -2.532291 -0.898454
H  1.202232 -3.743902 0.000037
