program: Gaussian 09
title: 000253218
version: EM64L-G09RevD.01
frameworkgroup: C1[X(C6H4Cl2O4S)]
method: RPBEPBE
basis: SDD
operation: Freq
keyword: #p
keyword: freq=noraman
keyword: PBEPBE/SDD
title: #p freq=noraman PBEPBE/SDD
converged: NO NO NO NO
title: Mulliken charges:
elementType: Cl Cl S O O O O C C C C C C H H H H
charge: -0.031736 0.015710 0.763174 -0.372436 -0.272505 -0.549845 -0.315536 -0.249546 -0.186330 -0.198025 0.487045 -0.220363 -0.226743 0.287855 0.320087 0.371882 0.377313
chargesum: 0.00000
title: Mulliken charges with hydrogens summed into heavy atoms:
elementType: Cl Cl S O O O O C C C C C C
charge: -0.031736 0.015710 0.763174 -0.000554 -0.272505 -0.549845 0.061776 -0.249546 0.101525 0.122062 0.487045 -0.220363 -0.226743
polarizability: 2.00553090e+02 2.36497374e+00 1.49422268e+02 3.60110886e+00 4.37642888e+00 6.42452654e+01
1716.lowfreq: -5.4676 -0.0018 -0.0005 0.0028 5.3331 10.5318 18.6054 51.8280 66.8079
frequency: 17.6778 51.7835 66.7855 100.8238 126.9846 142.3423 174.3695 190.3871 207.0430 246.6411 264.0849 281.0800 331.6459 348.0465 358.6549 436.6848 452.6440 473.2479 482.4843 496.9468 548.3067 575.5539 670.8913 727.9294 741.8305 817.9497 853.8400 873.0268 874.6870 909.4084 1049.4066 1077.4780 1142.4487 1219.4927 1283.6171 1293.2190 1375.6302 1403.2582 1451.0693 1566.2421 1581.7009 3143.0014 3170.7491 3424.7760 3485.2674
redmass: 9.5206 9.2193 9.2053 11.8843 14.4231 8.7439 18.1448 10.8605 5.1255 12.7081 8.2322 8.0106 8.2663 13.5125 12.3237 2.5717 2.8041 1.2294 4.3559 3.6376 5.2545 4.6617 10.9872 6.2571 9.6143 6.9017 14.7199 3.9753 1.9917 1.3111 3.2362 3.3309 1.4705 1.5736 2.0209 1.1123 3.9806 7.1136 3.8678 7.3329 8.6868 1.0922 1.0933 1.0686 1.0649
irintensity: 1.0439 0.4625 6.0815 0.0312 6.3601 3.6237 1.4930 4.9540 0.1553 6.2627 29.3103 15.3280 1.2125 17.5337 2.6942 35.9340 54.3862 137.6693 6.8818 20.8944 19.1928 18.4940 5.4932 9.1426 81.1741 15.5004 89.2203 105.9916 27.2543 15.4147 0.1783 131.2791 155.9382 146.0243 14.9014 37.5081 112.4930 11.6872 94.6307 35.8193 27.0045 19.6111 2.5209 51.2701 106.2845
temp: 298.150 k
press: 1.00000 atm
elementType: 17 17 16 8 8 8 8 6 6 6 6 6 6 1 1 1 1
symmnumber: 1
zpe: 242310.4 jmol-1
zpe.correction: 0.092291 hartree
zpe.thermalcorrener: 0.106350 hartree
zpe.thermalcorrenthalpy: 0.107295 hartree
zpe.thermalcorrgfe: 0.049098 hartree
zpe.sumelectzpe: -1848.973662 hartree
zpe.sumelectthermal: -1848.959603 hartree
zpe.sumelectthermalent: -1848.958659 hartree
zpe.sumelectthermalfe: -1849.016855 hartree
dipole: -1.1125 -0.8556 0.0261
dipole: 1.4037
quadrupole: -91.9833 -102.0730 -93.0942
quadrupole: 6.6208 2.4256 -4.6233
quadrupole: 3.7335 -6.3562 2.6227 6.6208 2.4256 -4.6233
hfenergy: -1849.0659531 hartree
pointgroup: C01 [X(C6H4Cl2O4S1)]
dipole: 0.4300285 -0.345959 -0.0191015 debye
dipolederiv: -0.393725 0.2711612 0.0767176 0.34422 -0.5620004 -0.0879462 0.1049097 -0.0986943 -0.0552276 -0.2359922 -0.247673 0.0092264 -0.3592769 -0.597061 -0.0013814 0.0211825 0.0108767 -0.0181601 1.1688415 0.1494132 -0.2429366 0.1971246 0.6079725 -0.2849279 -0.2465555 -0.0875532 0.4749875 -1.5447925 0.077774 0.1616577 0.0373515 -0.0991865 0.016886 0.2554916 0.0052661 -0.396533 0.5857234 -0.3799874 0.5284223 -0.0752938 -0.2268063 -0.1486285 0.1159079 0.0823617 -0.2054848 -0.515207 -0.0498683 0.1350474 -0.2044084 -0.5695176 0.3726199 0.0216834 -0.0711145 -0.3543085 -1.0799326 0.3973476 -0.397403 0.0165421 -0.0402024 0.1930401 -0.1808168 0.1891986 -0.2358403 -0.5100315 -0.0144689 0.0052012 -0.0425575 -0.0615083 -0.013266 0.1686086 0.0379127 -0.1734387 0.0419674 -0.1023661 -0.0121068 0.163723 -0.1150024 0.0121868 0.0442704 -0.0000519 -0.0297152 -0.0732562 0.0222265 0.0385677 -0.1654631 -0.2070105 -0.0182912 -0.0165341 -0.0044863 -0.0347184 1.3069169 -0.0191347 -0.1791687 0.0216085 -0.3252528 -0.0268896 -0.2514244 -0.0305707 0.1733583 0.1402126 -0.4094466 -0.1008371 -0.8387979 0.8192245 0.1658463 -0.1164151 0.1575556 -0.0555289 0.040534 0.3643424 -0.0205993 0.7969972 0.9311426 -0.0242185 0.0348685 -0.0170184 -0.0804254 0.1015502 0.0468432 0.0207364 0.025473 0.065166 -0.0135106 0.0035851 -0.0057297 0.1506667 0.195338 -0.0595459 0.0220095 0.0177725 0.106943 -0.0147933 0.00565 0.0046655 0.1615172 0.4949865 -0.0103662 -0.01102 -0.0093544 0.2007797 -0.0254028 -0.0271971 -0.0118213 0.3781639 0.2768667 -0.0362511 -0.0335149 0.0743395 0.0723199 -0.1013232 0.0627854 -0.1607967 0.3006873 unknown
polarizability: 200.5199641|-3.5695132|149.4462388|-0.3754425|-5.2253728|64.2544203 unknown
InChI: InChI=1S/C6H4Cl2O4S/c7-4-1-3(13(11)12-10)2-5(8)6(4)9/h1-2,9-10H
charge 0 multiplicity 1
17 atoms
Cl 2.40603 -2.719633 -0.397929
Cl 2.218812 2.805553 0.06418
S  -2.443108 -0.227867 0.886098
O  3.466006 0.138837 -0.401624
O  -2.815428 0.739592 -0.874188
O  -2.762462 -1.830343 0.702831
O  -4.249244 1.042827 -0.999466
C  -0.624667 -0.100055 0.474034
C  0.002644 1.161854 0.431673
C  0.062361 -1.302954 0.224547
C  2.120024 0.030651 -0.119664
C  1.426095 -1.210687 -0.065523
C  1.37507 1.213964 0.134879
H  -0.554439 2.086327 0.607105
H  -0.478746 -2.255678 0.256458
H  3.861655 -0.760274 -0.564155
H  -4.587204 0.280288 -1.555754
