program: Gaussian 09
title: 000253217
version: EM64L-G09RevD.01
frameworkgroup: C1[X(C5H8N2O2)]
method: RPBEPBE
basis: SDD
operation: Freq
keyword: #pfreq=noraman
keyword: PBEPBE/SDD
title: #p freq=noraman PBEPBE/SDD
converged: NO YES NO NO
title: Mulliken charges:
elementType: O O N N C C C C C H H H H H H H H
charge: -0.211847 -0.233900 -0.399780 -0.400677 -0.128433 -0.349620 0.167479 0.190499 -0.691182 0.256658 0.218024 0.237356 0.332822 0.352715 0.206976 0.216327 0.236586
chargesum: 0.00000
title: Mulliken charges with hydrogens summed into heavy atoms:
elementType: O O N N C C C C C
charge: -0.211847 -0.233900 -0.066958 -0.047962 0.128224 0.105759 0.167479 0.190499 -0.031293
polarizability: 8.80399853e+01 -6.65694686e+00 7.80358224e+01 -4.88753846e+00 -3.55056868e-01 4.66495928e+01
1716.lowfreq: -13.6685 -7.1033 0.0004 0.0007 0.0008 9.4173 77.2157 108.2319 160.2975
frequency: 77.2100 108.2205 160.2970 163.7574 225.3363 294.9106 386.3349 414.2494 465.7376 553.5628 602.7545 620.2351 659.6107 691.4893 724.7333 777.7411 848.0510 942.6251 954.6176 1002.1739 1063.2499 1116.2633 1119.2163 1177.5493 1232.7243 1249.6670 1300.0363 1310.2634 1335.9619 1341.3086 1369.5670 1395.9540 1463.2153 1477.2847 1485.2863 1684.1489 1725.9557 2975.6693 2977.3774 3000.7538 3050.8603 3077.6963 3083.7654 3592.1844 3615.7844
redmass: 3.3503 2.2768 9.5047 2.7489 1.2472 4.5228 6.6066 3.3342 1.1468 3.1457 9.6469 2.7220 1.5391 4.2609 6.5329 1.5387 2.1185 2.8597 3.1835 1.8173 2.3874 2.3705 1.6763 2.7383 1.9572 1.2838 1.8278 1.7530 1.3487 2.3709 1.7834 1.2224 1.0741 1.0540 1.0463 8.4343 9.5774 1.0807 1.0385 1.0611 1.1005 1.1019 1.0988 1.0803 1.0800
irintensity: 0.1117 0.8208 2.6209 1.6535 1.7949 6.9493 14.8471 5.2509 101.3784 19.5905 13.1604 43.7708 91.5729 5.3209 70.4340 20.0317 9.4975 10.5048 15.3016 15.1347 7.2613 19.6597 6.2485 71.7810 74.1740 0.6803 92.1445 14.6778 13.4557 101.4670 9.8059 9.1543 7.5263 13.3526 12.6932 588.1485 349.7038 14.7776 28.5253 16.5306 1.2539 55.1734 34.9596 69.7292 40.7293
temp: 298.150 k
press: 1.00000 atm
elementType: 8 8 7 7 6 6 6 6 6 1 1 1 1 1 1 1 1
symmnumber: 1
zpe: 352272.7 jmol-1
zpe.correction: 0.134174 hartree
zpe.thermalcorrener: 0.142889 hartree
zpe.thermalcorrenthalpy: 0.143833 hartree
zpe.thermalcorrgfe: 0.100343 hartree
zpe.sumelectzpe: -454.632215 hartree
zpe.sumelectthermal: -454.623500 hartree
zpe.sumelectthermalent: -454.622556 hartree
zpe.sumelectthermalfe: -454.666046 hartree
dipole: -2.9898 -1.3177 0.5744
dipole: 3.3174
quadrupole: -55.3035 -63.0200 -51.7101
quadrupole: 10.5235 -0.3016 -2.0625
quadrupole: 1.3744 -6.3421 4.9678 10.5235 -0.3016 -2.0625
hfenergy: -454.7663889 hartree
pointgroup: C01 [X(C5H8N2O2)]
dipole: 1.1401781 0.589799 0.2358453 debye
dipolederiv: -0.5648856 0.1784837 -0.0180937 0.2300928 -1.1347833 -0.0155017 -0.0113381 -0.066541 -0.3542816 -1.1630872 0.3187475 -0.0996033 0.4598316 -0.7525244 0.0339151 -0.1315034 0.022043 -0.3864907 -1.1420353 -0.1114209 -0.0732053 -0.0874474 -0.4456817 -0.0105072 -0.0532366 -0.0245312 -0.534801 -0.9023672 0.5845346 -0.0097125 0.3268554 -1.1621524 -0.0230087 -0.0871713 0.0199493 -0.3635385 0.1525193 -0.3359078 -0.0534549 -0.4995017 0.0027899 -0.1217076 -0.0872728 -0.1194593 0.3212029 0.1332195 0.0737454 0.0163351 0.0224139 0.0498686 -0.0156912 -0.0308606 -0.06424 0.0873442 1.2234262 -0.5789032 0.1312543 -0.2551237 1.3681364 0.0437166 0.243483 0.0646211 0.2371049 1.8408725 -0.2343808 0.2731927 -0.4073965 1.6367788 0.0866566 0.3137143 0.1340141 0.3713983 -0.0209167 -0.0842967 0.0215881 -0.0449575 0.0341692 -0.0216064 0.0615568 -0.0101733 0.0603144 0.0149316 0.0428811 -0.0571025 0.06896 0.0454163 0.0098635 -0.0556276 0.035894 -0.0896068 0.0146772 -0.021207 -0.0894974 -0.030622 0.0655221 0.0305745 -0.0457836 0.0122587 -0.1170347 -0.0048308 0.0465298 0.0034281 0.0759805 -0.073857 -0.0031469 0.0073432 0.0171962 0.0937704 0.2058389 0.011528 -0.0514569 0.0339255 0.1644653 -0.0178543 -0.0780364 -0.0085676 0.3539471 0.2128014 0.0255712 -0.0316436 0.0610423 0.1811584 -0.0167804 -0.0398553 -0.0258891 0.3595529 0.0326816 0.1438654 -0.0162264 0.0770555 -0.123693 -0.0037488 -0.0261345 -0.0029274 0.0870498 0.0747903 -0.0106714 -0.0536765 0.0037091 0.0629424 0.0474947 -0.1059518 0.0059771 -0.1452006 -0.1076356 -0.049099 0.1078749 -0.0348178 0.0814443 -0.0026678 0.1266746 0.0103754 0.019269 unknown
polarizability: 88.9357691|-6.0488331|77.1306021|4.4594394|1.5419776|46.6590292 unknown
InChI: InChI=1S/C5H8N2O2/c1-2-3-4(8)7-5(9)6-3/h3,6-7H,2H2,1H3
charge 0 multiplicity 1
17 atoms
O  0.228553 -2.447921 -0.026913
O  -2.563514 1.358436 -0.154994
N  -0.253295 1.070436 0.364517
N  -1.433999 -0.755134 -0.177648
C  0.718892 -0.03392 0.448976
C  1.953377 0.11202 -0.474586
C  -0.151907 -1.257388 0.063108
C  -1.530753 0.666501 -0.001939
C  2.881777 1.267421 -0.04872
H  1.068426 -0.175005 1.492742
H  1.606955 0.260149 -1.514978
H  2.496384 -0.851181 -0.445803
H  -0.046098 2.045276 0.56945
H  -2.236509 -1.31801 -0.459897
H  2.374118 2.248198 -0.116187
H  3.237445 1.134983 0.990394
H  3.769648 1.314837 -0.703421
