program: Gaussian 09
title: 000253216
version: EM64L-G09RevD.01
frameworkgroup: C1[X(C4H10N4O2)]
method: RPBEPBE
basis: SDD
operation: Freq
keyword: #p
keyword: freq=noraman
keyword: PBEPBE/SDD
title: #p freq=noraman PBEPBE/SDD
converged: YES YES NO NO
title: Mulliken charges:
elementType: O O N N N N C C C C H H H H H H H H H H
charge: -0.465112 -0.464028 -0.122328 -0.203051 -0.625741 -0.627054 0.120066 -0.379101 -0.433164 0.269727 0.225335 0.181344 0.268771 0.222524 0.356177 0.355606 0.312891 0.335295 0.306397 0.365443
chargesum: 0.00000
title: Mulliken charges with hydrogens summed into heavy atoms:
elementType: O O N N N N C C C C
charge: -0.108934 -0.108422 -0.122328 -0.203051 0.022445 0.044787 0.120066 0.027578 0.058131 0.269727
polarizability: 1.49057727e+02 2.18610386e-01 7.75990407e+01 -6.95832322e+00 9.19229052e-01 5.26025880e+01
1716.lowfreq: -1.5568 -0.0007 -0.0006 0.0003 3.2794 8.9031 50.0745 59.8875 68.6708
frequency: 50.0378 59.8788 68.6657 135.8398 142.9005 183.7333 229.3716 277.3036 304.9817 318.6013 360.8256 398.1474 418.8926 442.2993 508.2047 532.4053 584.0324 628.5370 652.2543 696.4023 731.8206 835.0671 882.3858 908.0621 929.2224 955.9356 987.3975 1022.0186 1047.9158 1119.5127 1140.9855 1194.6887 1276.3873 1296.1291 1321.4483 1344.2966 1409.8705 1455.1077 1464.1224 1496.8410 1523.4539 1590.5163 1592.6711 1629.7469 2926.8449 3029.3839 3082.6224 3102.0976 3386.2602 3476.7293 3559.6486 3560.0905 3678.3714 3711.5911
redmass: 3.9913 4.6504 5.7920 2.6100 3.6882 1.4901 4.5443 2.6437 3.6793 1.3747 2.3723 1.8312 1.5297 3.3852 1.1846 3.1809 4.1825 1.1103 2.6927 6.3877 1.5560 3.9925 2.9802 4.1418 2.4600 5.2254 2.0959 1.4995 1.9151 2.0455 1.3945 1.1829 3.8359 1.1989 1.2383 1.2080 1.1913 1.0822 1.0988 1.9122 3.1771 2.0524 3.0346 1.7283 1.0695 1.0567 1.0928 1.1084 1.0668 1.0496 1.0492 1.0621 1.0985 1.1046
irintensity: 1.1526 4.0351 7.1930 27.0611 7.9715 23.8927 15.7671 13.6176 5.4616 85.6096 103.4090 135.8640 283.1432 5.5010 61.2274 3.8482 38.9211 158.9120 19.1935 29.3442 131.2932 39.0871 54.9388 89.9076 43.7347 77.7424 4.4022 1.7335 2.8795 46.1086 18.5185 68.9070 5.7753 8.2133 34.8351 11.7550 130.8969 13.3824 9.0938 11.2394 399.7794 475.6645 8.4570 470.2211 91.1293 33.4738 27.9700 9.1126 92.1510 45.1556 62.6893 22.4421 67.0002 38.5478
temp: 298.150 k
press: 1.00000 atm
elementType: 8 8 7 7 7 7 6 6 6 6 1 1 1 1 1 1 1 1 1 1
symmnumber: 1
zpe: 416674.6 jmol-1
zpe.correction: 0.158703 hartree
zpe.thermalcorrener: 0.170489 hartree
zpe.thermalcorrenthalpy: 0.171433 hartree
zpe.thermalcorrgfe: 0.120668 hartree
zpe.sumelectzpe: -527.030028 hartree
zpe.sumelectthermal: -527.018242 hartree
zpe.sumelectthermalent: -527.017298 hartree
zpe.sumelectthermalfe: -527.068063 hartree
dipole: 7.1148 0.9973 0.2058
dipole: 7.1873
quadrupole: -48.7047 -57.1022 -59.5963
quadrupole: -4.9315 -6.9080 -3.3187
quadrupole: 6.4297 -1.9678 -4.4619 -4.9315 -6.9080 -3.3187
hfenergy: -527.1887311 hartree
pointgroup: C01 [X(C4H10N4O2)]
dipole: 2.8207941 -0.1006059 -0.1700927 debye
dipolederiv: -0.9306631 0.0200078 0.0799268 0.0825754 -0.399057 0.1274312 0.1765507 0.0874378 -0.6319129 -0.4853308 -0.024508 0.2052633 -0.2389683 -0.8127518 0.0681923 0.4070855 0.130766 -0.4867005 0.8824034 0.0161715 0.0696784 -0.6603634 -0.3989185 -0.0277103 0.0837828 -0.0160158 -0.1531419 -1.9905525 -0.145867 -0.1155344 0.1220552 -0.4041048 -0.0160357 -0.1860125 -0.0097261 -0.2785781 -1.5051157 0.352452 0.0921299 0.5457606 -0.4935443 0.0960221 0.2032499 0.0672529 -0.6833077 -0.5457347 -0.1498335 -0.0608531 -0.5161925 -1.1246332 -0.1171409 -0.1454765 -0.1485059 -0.6868447 -0.2201234 -0.0148137 0.0607474 -0.1524543 0.1744119 0.0460303 -0.104069 0.0162404 -0.2248159 0.5244189 0.0485869 -0.0791967 -0.1696745 0.2039273 -0.1193763 -0.0907486 -0.1087733 0.5458197 0.2312219 0.0489681 -0.106481 0.4437877 0.2821219 -0.0544558 -0.2530655 -0.0776278 0.5418987 2.5697724 -0.0341971 0.1307275 0.6106403 1.402442 0.1660642 0.2447486 0.1065893 0.2778776 0.0663159 -0.1033881 0.0299839 -0.0316481 -0.1198659 0.0189364 0.0075393 -0.0286584 0.0666242 -0.1382008 0.0146712 -0.1025085 0.0044281 0.0707819 -0.0543464 -0.0646785 0.0121832 -0.2187535 0.0242564 0.1364308 0.0741509 0.0676094 0.0183653 0.0124547 0.0412806 0.0242184 0.0456273 -0.0433786 -0.080761 -0.1109617 -0.0913592 0.0756437 0.0087909 -0.0499839 -0.0060013 -0.0604255 0.4981445 -0.0715523 0.0226117 -0.0448436 0.2994993 -0.0256897 -0.0190096 -0.0237676 0.2765532 0.1264732 -0.0143292 -0.1190208 0.031709 0.384957 -0.0423887 -0.1309679 -0.0293158 0.1619299 0.2412912 -0.0243593 -0.0469819 0.0058022 0.1669635 -0.052689 -0.1405923 -0.0424158 0.3665147 0.2327151 -0.0506009 -0.0394055 -0.0753698 0.2006217 -0.023419 -0.0565768 -0.0086811 0.3776939 0.1450494 -0.0020543 0.007619 -0.0096352 0.209301 -0.0171631 0.0493294 0.024708 0.4134025 0.3170374 0.0789762 0.0081049 0.076141 0.2638392 0.0064929 0.0276142 0.0300929 0.350539 unknown
polarizability: 148.6619907|7.330881|78.3766974|3.6001344|0.9416757|52.2206673 unknown
InChI: InChI=1S/C4H10N4O2/c5-4(6)8-7-3(1-9)2-10/h9-10H,1-2,5-6H2
charge 0 multiplicity 1
20 atoms
O  -3.135846 0.789161 0.722348
O  -2.222151 -1.885922 0.643077
N  0.172552 0.531374 -0.216949
N  1.236994 -0.409669 -0.17973
N  3.559416 -0.533993 -0.009145
N  2.518476 1.595769 0.150709
C  -1.040523 0.039948 -0.384718
C  -2.204921 1.010066 -0.403354
C  -1.369376 -1.437805 -0.50909
C  2.411272 0.234602 -0.013598
H  -1.832829 2.042501 -0.305784
H  -2.756939 0.913679 -1.365523
H  -0.447048 -2.038955 -0.569137
H  -2.009285 -1.627028 -1.387349
H  -3.20567 -0.200963 0.850384
H  -1.649987 -1.915285 1.452229
H  4.456702 -0.169881 0.296394
H  3.439411 -1.535136 -0.142699
H  3.399881 2.09867 0.137182
H  1.618973 2.084867 0.121149
