program: Gaussian 09
title: 000253214
version: EM64L-G09RevD.01
frameworkgroup: C1[X(C9H15NO2)]
method: RPBEPBE
basis: SDD
operation: Freq
keyword: #p
keyword: freq=noraman
keyword: PBEPBE/SDD
title: #p freq=noraman PBEPBE/SDD
converged: NO YES NO NO
title: Mulliken charges:
elementType: O O N C C C C C C C C C H H H H H H H H H H H H H H H
charge: -0.437666 -0.290862 -0.123086 -0.106606 -0.100617 -0.462986 -0.466342 -0.475443 -0.459657 -0.076021 0.196624 -0.784715 0.280469 0.239252 0.211823 0.239425 0.234891 0.214726 0.232240 0.218571 0.200808 0.230266 0.235015 0.323021 0.228114 0.232107 0.266648
chargesum: 0.00000
title: Mulliken charges with hydrogens summed into heavy atoms:
elementType: O O N C C C C C C C C C
charge: -0.114645 -0.290862 -0.123086 0.173864 0.138635 -0.011738 -0.016725 -0.024632 -0.028583 0.158994 0.196624 -0.057845
polarizability: 1.13113478e+02 -6.64069172e+00 9.80983786e+01 -1.62675541e+00 1.64303200e+00 9.95597067e+01
1716.lowfreq: -28.8695 -18.5717 -11.2316 -0.0007 -0.0006 0.0005 38.5553 96.9264 118.8938
frequency: 37.9288 96.8929 118.8766 148.4894 167.4628 190.8939 277.0351 306.3566 324.2433 343.7883 353.2004 433.7976 457.4009 471.6031 508.9778 551.0158 596.7277 631.3827 740.9299 763.2270 794.0419 845.8394 857.5562 870.7017 900.9689 937.1450 971.4165 979.5745 990.6162 1011.8054 1027.6735 1036.3513 1055.9798 1076.6655 1099.5608 1136.3884 1140.8784 1177.9468 1185.6490 1226.7577 1227.7464 1255.4320 1258.9413 1270.9752 1298.2280 1306.4005 1316.0141 1320.4077 1347.6138 1350.8133 1371.1046 1377.3672 1411.4308 1449.9481 1451.6192 1462.3776 1469.8878 1471.3233 1488.4727 1589.6910 2976.1151 2982.8409 2986.2608 3012.6191 3025.7829 3032.0754 3050.5584 3061.6286 3064.1098 3071.4523 3073.0565 3086.8789 3093.8035 3129.9751 3540.2563
redmass: 6.2694 3.3181 1.0696 3.6292 2.4233 2.4012 1.3789 2.7167 2.2329 2.5425 4.7086 3.0234 2.1961 3.8007 3.7008 3.3555 3.6168 3.1245 4.6513 3.9293 1.5010 2.4283 2.4920 1.5697 3.2183 2.4603 2.1047 3.0136 1.8530 1.7177 1.6603 2.4126 2.1044 2.0959 1.6359 1.5792 1.4271 1.2003 1.9365 1.3942 1.5050 1.6364 1.5127 1.3740 1.3998 1.4716 1.3104 1.5810 1.4043 1.4164 1.2249 1.1964 4.4451 1.1054 1.0864 1.0938 1.0513 1.0810 1.0945 7.2373 1.0627 1.0629 1.0380 1.0592 1.0625 1.0870 1.0997 1.0979 1.1001 1.0963 1.0950 1.0947 1.0987 1.0982 1.0659
irintensity: 2.0240 3.6764 0.7897 4.5214 3.8547 2.9782 41.8371 0.5739 9.0014 80.4677 0.3739 2.0400 3.0774 0.5201 4.5040 3.9605 10.4221 6.0251 3.0854 1.8269 7.5787 6.5916 12.8697 0.9778 0.6942 7.0658 23.1427 73.7974 2.3421 7.5759 3.3161 59.4756 0.4450 32.6442 0.7795 6.2728 6.2623 30.6012 14.3511 2.5897 7.1679 5.0886 31.4559 1.2922 2.0283 0.9672 3.0501 29.0593 10.6253 3.1355 26.1164 31.3731 234.0103 34.8152 6.5247 8.9115 24.7536 7.9873 11.7350 314.4192 24.9755 26.1272 9.0172 24.2075 44.9570 4.6772 19.9187 50.3012 20.7984 25.9747 12.3685 28.1677 40.4048 11.3055 5.9260
temp: 298.150 k
press: 1.00000 atm
elementType: 8 8 7 6 6 6 6 6 6 6 6 6 1 1 1 1 1 1 1 1 1 1 1 1 1 1 1
symmnumber: 1
zpe: 607266.0 jmol-1
zpe.correction: 0.231295 hartree
zpe.thermalcorrener: 0.242864 hartree
zpe.thermalcorrenthalpy: 0.243808 hartree
zpe.thermalcorrgfe: 0.193887 hartree
zpe.sumelectzpe: -556.214844 hartree
zpe.sumelectthermal: -556.203275 hartree
zpe.sumelectthermalent: -556.202331 hartree
zpe.sumelectthermalfe: -556.252252 hartree
dipole: -0.7617 1.5575 2.9434
dipole: 3.4160
quadrupole: -88.6129 -67.8316 -73.2558
quadrupole: -1.1930 9.7179 -2.2700
quadrupole: -12.0462 8.7352 3.3110 -1.1930 9.7179 -2.2700
hfenergy: -556.4461393 hartree
pointgroup: C01 [X(C9H15N1O2)]
dipole: 0.3438375 0.702369 -1.0930273 debye
polarizability: 113.4336525|6.4904775|98.1149238|-0.71088|-1.5458143|99.2229864 unknown
InChI: InChI=1S/C9H15NO2/c1-6(11)10-7-2-3-8(10)5-9(12)4-7/h7-9,12H,2-5H2,1H3
charge 0 multiplicity 1
27 atoms
O  2.873155 -1.704344 -0.122023
O  -2.521916 -0.812089 1.210588
N  -0.848312 0.270178 0.025973
C  0.016671 0.544295 1.201691
C  -0.029706 0.634969 -1.156668
C  0.593274 1.95012 0.849712
C  0.566239 2.011113 -0.720547
C  1.115143 -0.557268 1.24538
C  1.070416 -0.455142 -1.326707
C  1.956634 -0.550847 -0.055535
C  -2.043348 -0.424038 0.096681
C  -2.764303 -0.676856 -1.228997
H  -0.592176 0.526288 2.118293
H  -0.646708 0.710996 -2.066272
H  1.609736 2.085501 1.259321
H  -0.048586 2.738548 1.277612
H  -0.086561 2.831384 -1.064427
H  1.56727 2.173618 -1.157995
H  1.78166 -0.413754 2.115648
H  0.612958 -1.538226 1.368617
H  0.577118 -1.432568 -1.506364
H  1.708082 -0.239178 -2.203806
H  2.654783 0.304335 -0.036039
H  2.335298 -2.536294 -0.070465
H  -2.167942 -1.322308 -1.900561
H  -2.976637 0.266435 -1.764592
H  -3.715141 -1.182268 -1.00522
