program: Gaussian 09
title: 000253213
version: EM64L-G09RevD.01
frameworkgroup: C1[X(C8H12O7)]
method: RPBEPBE
basis: SDD
operation: Freq
keyword: #pfreq=noraman
keyword: PBEPBE/SDD
title: #p freq=noraman PBEPBE/SDD
converged: YES YES NO NO
title: Mulliken charges:
elementType: O O O O O O O C C C C C C C C H H H H H H H H H H H H
charge: -0.471649 -0.265828 -0.277342 -0.240710 -0.410347 -0.220220 -0.234665 0.223483 -0.553297 -0.520564 0.193401 0.279652 0.208141 -0.500675 -0.497370 0.256541 0.248996 0.257941 0.306364 0.373602 0.259354 0.234135 0.245962 0.380033 0.250439 0.242934 0.231688
chargesum: 0.00000
title: Mulliken charges with hydrogens summed into heavy atoms:
elementType: O O O O O O O C C C C C C C C
charge: -0.098047 -0.265828 -0.277342 -0.240710 -0.030315 -0.220220 -0.234665 0.223483 -0.047760 0.043741 0.193401 0.279652 0.208141 0.238777 0.227691
polarizability: 1.26539746e+02 -7.46045745e+00 1.09664023e+02 -7.93730192e-01 -5.48368015e+00 9.01507703e+01
1716.lowfreq: -4.2011 -0.0005 0.0002 0.0010 5.9404 11.7648 30.1045 43.0671 52.3063
frequency: 30.0261 43.0277 52.2956 63.3600 70.9002 89.9909 104.0788 111.3887 119.9837 135.4384 176.2973 200.4631 212.2664 238.4392 283.9947 296.2348 325.1728 341.4329 385.2605 417.7459 437.3295 494.2477 520.0528 568.1211 597.2330 624.8544 655.9238 712.9272 733.0209 779.0742 790.9785 861.9334 881.6369 920.4076 926.6529 963.8268 1011.0781 1061.8088 1076.7421 1078.7812 1113.4899 1114.2861 1149.7177 1153.4368 1169.9013 1174.7160 1214.5344 1267.6873 1278.1417 1297.6901 1366.1329 1375.2847 1419.9758 1422.8697 1426.5251 1441.8131 1452.1805 1452.4670 1463.5054 1464.5965 1627.0132 1654.4292 1661.9591 3008.0400 3011.0482 3022.9569 3029.0369 3096.0917 3111.9615 3112.6512 3118.6993 3151.1120 3157.2251 3462.7692 3508.8781
redmass: 5.3839 5.8048 5.1822 4.0745 4.7505 1.1854 1.3193 2.7639 4.2958 5.1092 4.0868 5.0868 5.1754 6.3517 3.5251 4.0558 2.8715 7.3527 3.1672 1.2372 3.2485 2.6934 3.1677 4.7080 5.2844 4.2546 1.5349 6.0020 5.5954 5.4210 4.7584 3.9402 3.9735 4.5181 2.4749 6.5984 3.5725 2.8957 2.8146 2.3006 1.2658 1.2677 1.4347 1.4352 2.2976 2.8989 1.7064 1.6017 1.8483 1.3318 2.1270 1.6054 1.1534 1.1843 1.1312 1.0936 1.0499 1.0496 1.0513 1.0507 9.6792 9.4313 8.4126 1.0292 1.0289 1.0598 1.0640 1.1031 1.0973 1.1028 1.1054 1.1053 1.1056 1.0650 1.0639
irintensity: 1.7017 1.3128 0.2284 3.0538 0.1093 0.5725 0.9958 2.0153 0.6400 1.0384 0.0547 6.5303 3.6381 0.4034 11.5165 11.7069 44.5082 18.6654 14.7263 102.7239 8.1987 24.2675 47.0492 21.3591 5.1100 40.9539 115.1200 10.6122 1.5389 1.9879 21.6416 10.3398 7.2760 18.9398 9.3480 35.7262 70.2545 132.6801 112.7355 156.6770 0.1033 1.1251 8.2866 1.7152 153.4875 266.8264 142.5309 0.7069 55.0020 8.9457 115.3334 20.2149 5.7011 17.0250 51.8542 14.0467 14.2317 16.0709 11.5677 10.6796 130.5737 207.4914 245.3372 32.5343 26.7240 5.3700 3.7149 4.9433 11.9135 13.4866 17.5122 13.8226 12.5445 51.4622 27.2914
temp: 298.150 k
press: 1.00000 atm
elementType: 8 8 8 8 8 8 8 6 6 6 6 6 6 6 6 1 1 1 1 1 1 1 1 1 1 1 1
symmnumber: 1
zpe: 528433.9 jmol-1
zpe.correction: 0.201270 hartree
zpe.thermalcorrener: 0.218601 hartree
zpe.thermalcorrenthalpy: 0.219545 hartree
zpe.thermalcorrgfe: 0.154446 hartree
zpe.sumelectzpe: -837.441720 hartree
zpe.sumelectthermal: -837.424389 hartree
zpe.sumelectthermalent: -837.423445 hartree
zpe.sumelectthermalfe: -837.488544 hartree
dipole: 1.0707 1.3735 -3.8269
dipole: 4.2045
quadrupole: -79.0274 -81.6152 -89.1516
quadrupole: -7.9994 -2.5032 5.6887
quadrupole: 4.2373 1.6495 -5.8868 -7.9994 -2.5032 5.6887
hfenergy: -837.6429897 hartree
pointgroup: C01 [X(C8H12O7)]
dipole: -0.3198804 -0.1011854 -1.6198082 debye
polarizability: 125.8173749|-8.9241713|106.153315|1.2870214|9.190793|94.3838497 unknown
InChI: InChI=1S/C8H12O7/c1-14-6(11)4-8(13,3-5(9)10)7(12)15-2/h9,13H,3-4H2,1-2H3
charge 0 multiplicity 1
27 atoms
O  0.253773 -0.345036 1.47583
O  -1.84067 1.447679 -0.926908
O  2.872625 -0.18334 -0.666678
O  -1.875199 1.349014 1.404042
O  -1.023449 -3.017768 -1.233804
O  3.259536 1.348957 1.041129
O  -2.326035 -1.487958 -0.078038
C  -0.02012 0.281097 0.18579
C  1.08546 1.349744 -0.125439
C  -0.071968 -0.840636 -0.869685
C  -1.358331 1.051002 0.302233
C  2.497286 0.867686 0.177525
C  -1.251495 -1.765617 -0.656715
C  -3.145291 2.160265 -0.908191
C  4.227116 -0.741412 -0.424728
H  0.921945 2.23491 0.511998
H  1.014681 1.656712 -1.184027
H  -0.153855 -0.410279 -1.884949
H  0.866497 -1.413821 -0.83257
H  -0.336706 0.083607 2.156274
H  -3.921982 1.482224 -0.518638
H  -3.334782 2.425891 -1.956992
H  -3.079763 3.056994 -0.270365
H  -1.825796 -3.592506 -1.098045
H  4.299237 -1.121966 0.607429
H  4.991725 0.037886 -0.579933
H  4.331362 -1.553426 -1.157745
