program: Gaussian 09
title: 000253210
version: EM64L-G09RevD.01
frameworkgroup: C1[X(C7H14Cl2N2O2)]
method: RPBEPBE
basis: SDD
operation: Freq
keyword: #p
keyword: freq=noraman
keyword: PBEPBE/SDD
title: #p freq=noraman PBEPBE/SDD
converged: YES YES NO NO
title: Mulliken charges:
elementType: Cl Cl O O N N C C C C C C C H H H H H H H H H H H H H H
charge: -0.074109 -0.071919 -0.408745 -0.246323 -0.107485 -0.323950 -0.121930 -0.278782 -0.370154 -0.689365 -0.585741 -0.568373 0.178052 0.262567 0.227466 0.223889 0.233287 0.284572 0.273690 0.219019 0.245364 0.238475 0.262479 0.281144 0.274658 0.260217 0.381996
chargesum: 0.00000
title: Mulliken charges with hydrogens summed into heavy atoms:
elementType: Cl Cl O O N N C C C C C C C
charge: -0.074109 -0.071919 -0.026749 -0.246323 -0.107485 -0.050259 0.140637 0.172574 0.147705 0.013493 -0.042118 -0.033499 0.178052
polarizability: 1.37991891e+02 -7.16695686e+00 1.26688693e+02 -1.66553483e+00 -5.54296341e+00 8.86605275e+01
1716.lowfreq: -8.1319 -7.1764 -0.0018 -0.0013 0.0012 3.8914 17.1871 29.7539 42.3388
frequency: 15.3998 29.7120 42.3079 55.9450 58.5525 74.5332 83.7475 142.1182 192.0134 197.0693 208.0476 212.9951 233.5130 255.4543 305.1746 343.3294 373.9535 439.4210 486.0782 516.2155 584.7712 604.5581 615.0576 668.3960 687.3100 707.4435 769.9832 784.9816 790.6875 852.9161 918.1469 995.0687 999.8705 1032.7693 1051.7573 1064.3401 1069.3836 1074.8752 1091.8330 1102.3105 1185.3435 1196.8359 1215.0516 1244.3898 1248.0711 1252.9117 1265.7672 1288.0513 1293.7023 1334.3823 1361.1195 1367.1514 1384.0309 1450.4521 1453.1008 1459.1275 1466.0465 1473.1731 1482.0010 1486.6666 1652.5678 2946.2455 2951.1646 2994.0843 3054.3585 3059.6944 3060.1507 3065.8882 3083.3469 3095.1089 3114.1920 3148.8525 3156.1081 3364.7877 3500.1207
redmass: 5.0211 8.3992 10.2232 7.3664 5.1993 2.3133 2.6968 5.3449 4.2161 4.0466 1.7498 1.7735 5.2924 2.5464 3.5928 3.0773 4.1348 3.5548 3.2148 3.8648 1.9433 1.3295 4.8530 5.9658 5.6086 3.6381 2.8691 1.1405 1.1499 3.0351 1.7524 1.5738 1.5806 2.7171 1.9705 2.4928 3.1463 2.0926 2.3804 2.1621 2.4549 1.8696 1.7396 1.4372 1.2100 1.2116 1.4726 1.1382 1.1949 1.4981 1.2811 1.3375 1.2214 1.0945 1.0928 1.0996 1.0677 1.0844 1.0766 1.1210 8.2999 1.0673 1.0679 1.0358 1.0945 1.0719 1.0714 1.0562 1.0936 1.0983 1.1012 1.1115 1.1120 1.0742 1.0641
irintensity: 0.6786 0.5424 0.2739 2.6326 0.6479 2.1186 1.0784 1.9959 10.3234 10.3836 0.9757 0.1876 0.2270 4.7225 5.9471 3.8681 3.9777 8.6474 13.8098 21.3506 55.2170 119.5563 101.5241 56.7591 77.7106 31.6612 1.0956 9.5099 5.7721 27.3630 1.8733 5.8648 14.9375 254.9852 36.5475 11.0786 8.5382 3.5610 22.4827 2.7942 11.6880 5.7706 3.2482 4.9205 11.3710 12.5935 7.0206 2.1789 0.5353 11.1484 1.9053 0.8084 18.3239 4.7945 2.9142 4.8402 25.1851 6.6486 11.5745 7.3580 194.7545 9.1597 75.9983 17.9748 18.5702 5.6893 13.6091 17.6374 0.3862 24.4797 15.7590 14.4200 13.4444 3.4215 18.6833
temp: 298.150 k
press: 1.00000 atm
elementType: 17 17 8 8 7 7 6 6 6 6 6 6 6 1 1 1 1 1 1 1 1 1 1 1 1 1 1
symmnumber: 1
zpe: 561563.5 jmol-1
zpe.correction: 0.213888 hartree
zpe.thermalcorrener: 0.229936 hartree
zpe.thermalcorrenthalpy: 0.230880 hartree
zpe.thermalcorrgfe: 0.166424 hartree
zpe.sumelectzpe: -1454.123203 hartree
zpe.sumelectthermal: -1454.107155 hartree
zpe.sumelectthermalent: -1454.106211 hartree
zpe.sumelectthermalfe: -1454.170668 hartree
dipole: -1.2718 -3.2513 0.4217
dipole: 3.5165
quadrupole: -108.1847 -95.3343 -89.8112
quadrupole: 8.8460 -5.3210 0.3605
quadrupole: -10.4080 2.4424 7.9656 8.8460 -5.3210 0.3605
hfenergy: -1454.3370913 hartree
pointgroup: C01 [X(C7H14Cl2N2O2)]
dipole: 1.2903154 -0.1453155 -0.477563 debye
polarizability: 121.6079012|7.9082417|128.2830846|-7.2306697|21.743939|103.4501248 unknown
InChI: InChI=1S/C7H14Cl2N2O2/c1-6(7(12)13)10-11(4-2-8)5-3-9/h6,10,12H,2-5H2,1H3
charge 0 multiplicity 1
27 atoms
Cl -3.403798 -2.778834 -1.57511
Cl -2.182622 3.548523 1.913832
O  2.649198 1.791225 -1.358433
O  2.083785 1.602862 0.885969
N  -0.875929 0.022179 0.145825
N  0.376531 -0.690543 0.198174
C  1.426956 -0.203179 -0.706779
C  -2.010489 -0.929073 0.000348
C  -1.098333 1.055339 1.208241
C  2.554584 -1.261939 -0.814832
C  -1.994284 -1.529361 -1.40676
C  -1.767012 2.278492 0.569913
C  2.055374 1.136663 -0.275316
H  0.970738 -0.050205 -1.698714
H  -1.966996 -1.741151 0.758573
H  -2.951429 -0.370152 0.154163
H  -1.730612 0.668129 2.036338
H  -0.122638 1.349935 1.627354
H  0.714496 -0.865253 1.159789
H  3.024311 -1.443208 0.169496
H  2.124492 -2.210605 -1.175913
H  3.336129 -0.927132 -1.517157
H  -2.164609 -0.770276 -2.183739
H  -1.06871 -2.091873 -1.591961
H  -1.097463 2.790975 -0.13503
H  -2.726797 2.038515 0.087832
H  3.083726 2.63275 -1.048907
