program: Gaussian 09
title: 000253209
version: EM64L-G09RevD.01
frameworkgroup: C1[X(C10H10N4O2S)]
method: RPBEPBE
basis: SDD
operation: Freq
keyword: #p
keyword: freq=noraman
keyword: PBEPBE/SDD
title: #p freq=noraman PBEPBE/SDD
converged: YES YES NO NO
title: Mulliken charges:
elementType: S O O N N N N C C C C C C C C C C H H H H H H H H H H
charge: 0.284444 -0.216793 -0.171398 -0.075303 -0.024882 0.059704 -0.692549 -0.147518 0.102713 -0.342234 -0.201159 -0.627790 0.441391 -0.187260 -0.386134 -0.265007 -0.196407 0.267440 0.252747 0.234174 0.293674 0.294805 0.221235 0.236115 0.226727 0.306648 0.312618
chargesum: 0.00000
title: Mulliken charges with hydrogens summed into heavy atoms:
elementType: S O O N N N N C C C C C C C C C C
charge: 0.284444 -0.216793 -0.171398 -0.075303 -0.024882 0.059704 -0.073283 -0.147518 0.102713 -0.342234 0.066281 0.152805 0.441391 0.107544 -0.164899 -0.028893 0.030320
polarizability: 2.08130931e+02 -5.75132809e+00 1.71453700e+02 1.67312474e+00 7.45326525e+00 1.07547056e+02
1716.lowfreq: -16.4968 -0.0009 0.0014 0.0022 4.7396 6.1335 27.4988 44.5108 62.0853
frequency: 25.1918 44.4744 62.0619 71.7068 76.1676 107.1559 135.4972 154.0947 214.2989 233.2088 252.2451 263.1868 276.1828 362.9087 377.2786 385.2942 410.2379 436.8196 453.6957 486.1457 504.6653 537.2863 543.7388 547.3756 635.5400 644.8485 653.8419 695.4508 724.2943 735.8444 761.0471 761.9868 798.0938 824.8033 851.8080 957.7970 959.6629 983.8121 997.0914 1029.8620 1043.9969 1045.2865 1090.3229 1123.0920 1140.0234 1173.6062 1180.7596 1228.7369 1275.2715 1281.8767 1305.7083 1317.3603 1347.9377 1368.2384 1380.5921 1415.2077 1439.2056 1450.2520 1461.9886 1468.4894 1479.2407 1493.6856 1573.1416 1605.2215 1627.5502 3003.7484 3100.3540 3119.2249 3120.4433 3141.8256 3155.2561 3172.8012 3238.3633 3529.0453 3677.1452
redmass: 4.5719 7.6199 5.6407 1.1393 7.8497 4.3725 7.8569 4.7313 4.4825 5.6322 5.3664 6.2672 5.4817 6.0381 6.1269 8.4286 1.1433 3.0477 3.8648 3.6603 1.3425 6.3607 4.1910 5.7110 5.9793 4.9605 6.4587 7.5121 3.5120 9.1944 1.4906 6.3825 1.4679 5.2777 1.4280 4.6599 1.5121 1.3167 4.5761 1.9464 1.9614 1.8603 4.6746 1.3310 1.3407 1.0558 3.1064 2.4420 1.7643 7.9374 3.9629 1.8313 7.5374 13.6917 7.5153 2.0767 2.4895 6.4609 1.1163 1.5277 2.2816 1.2435 6.3014 2.5728 1.5946 1.0337 1.1024 1.0872 1.1021 1.0909 1.0927 1.1000 1.0992 1.0458 1.1023
irintensity: 1.3352 0.0897 3.1768 0.7162 3.0383 0.4529 1.2366 1.8609 3.2766 1.7955 1.4057 2.0632 6.3286 1.5668 0.7437 1.0085 114.2069 30.9198 5.1520 48.9123 103.0429 7.3589 0.9818 0.9050 12.8458 2.4476 7.2541 1.3793 1.5879 0.5461 77.5304 61.9668 23.1666 5.4080 1.1700 13.4406 9.1422 0.7579 7.7875 5.4309 3.0582 18.2296 4.4152 1.5689 9.8970 6.7848 43.3958 132.7655 29.0902 33.5416 12.8339 17.6259 7.0420 177.1089 13.0343 7.4460 14.6417 45.3920 13.1490 31.5294 94.8356 25.4430 3.5871 1.2121 251.6814 24.8175 8.9181 10.0957 5.5505 23.5881 3.0082 25.6232 0.4686 39.3342 35.2829
temp: 298.150 k
press: 1.00000 atm
elementType: 16 8 8 7 7 7 7 6 6 6 6 6 6 6 6 6 6 1 1 1 1 1 1 1 1 1 1
symmnumber: 1
zpe: 511712.8 jmol-1
zpe.correction: 0.194901 hartree
zpe.thermalcorrener: 0.210829 hartree
zpe.thermalcorrenthalpy: 0.211773 hartree
zpe.thermalcorrgfe: 0.150080 hartree
zpe.sumelectzpe: -1153.251944 hartree
zpe.sumelectthermal: -1153.236016 hartree
zpe.sumelectthermalent: -1153.235072 hartree
zpe.sumelectthermalfe: -1153.296766 hartree
dipole: -6.5118 7.6062 -0.7247
dipole: 10.0391
quadrupole: -114.7589 -93.5818 -105.4335
quadrupole: 6.4038 0.5557 3.9998
quadrupole: -10.1675 11.0096 -0.8421 6.4038 0.5557 3.9998
hfenergy: -1153.4468452 hartree
pointgroup: C01 [X(C10H10N4O2S1)]
dipole: -2.5345804 -3.0084822 0.3535889 debye
polarizability: 207.8914298|6.1790364|171.5262811|-4.4311326|7.2814268|107.7139766 unknown
InChI: InChI=1S/C10H10N4O2S/c1-13-6-12-9(14(15)16)10(13)17-8-5-3-2-4-7(8)11/h2-6H,11H2,1H3
charge 0 multiplicity 1
27 atoms
S  -0.136498 -0.321625 -1.580676
O  1.768078 2.199412 -0.772995
O  3.961824 1.684575 -0.392041
N  1.276682 -1.884079 0.321964
N  3.107845 -0.669984 0.904832
N  2.711148 1.386112 -0.406246
N  -2.818661 -1.733323 -0.925485
C  1.167253 -0.667829 -0.370895
C  2.31871 0.048806 0.016059
C  -1.501945 0.305895 -0.468257
C  2.448027 -1.829668 1.075565
C  0.339388 -3.01612 0.253845
C  -2.679864 -0.486878 -0.307888
C  -1.369995 1.566278 0.150706
C  -3.716087 0.032087 0.524965
C  -2.404864 2.059362 0.975264
C  -3.574296 1.281697 1.156928
H  2.764729 -2.638356 1.730017
H  0.392194 -3.503647 -0.734565
H  0.616978 -3.746029 1.030688
H  -0.692764 -2.672835 0.428143
H  -0.45829 2.14666 -0.021839
H  -4.630862 -0.556609 0.666636
H  -2.301392 3.035139 1.459251
H  -4.386899 1.655459 1.790278
H  -3.713284 -2.215156 -0.893205
H  -2.140253 -2.013344 -1.632155
