program: Gaussian 09
title: 000253194
version: EM64L-G09RevD.01
frameworkgroup: C1[X(C12H19NO6)]
method: RPBEPBE
basis: SDD
operation: Freq
keyword: #p
keyword: freq=noraman
keyword: PBEPBE/SDD
title: #p freq=noraman PBEPBE/SDD
converged: YES YES NO NO
title: Mulliken charges:
elementType: O O O O O O N C C C C C C C C C C C C H H H H H H H H H H H H H H H H H H H
charge: -0.245673 -0.211320 -0.262788 -0.244936 -0.249959 -0.271472 -0.399648 -0.239671 -0.525749 0.157335 -0.513199 0.292715 0.256472 0.261948 -0.260973 -0.775427 -0.262872 -0.663646 -0.663241 0.312708 0.283866 0.295499 0.257143 0.277310 0.341081 0.242518 0.229135 0.235811 0.225557 0.218394 0.253954 0.252167 0.230669 0.246438 0.222653 0.219365 0.249159 0.228676
chargesum: 0.00000
title: Mulliken charges with hydrogens summed into heavy atoms:
elementType: O O O O O O N C C C C C C C C C C C C
charge: -0.245673 -0.211320 -0.262788 -0.244936 -0.249959 -0.271472 -0.058567 0.073037 0.053616 0.157335 0.021255 0.292715 0.256472 0.261948 0.210680 -0.050911 0.198496 0.036114 0.033959
polarizability: 1.99373534e+02 -5.93747164e+00 1.42290558e+02 -1.66659166e+00 2.50662818e+00 1.33831846e+02
1716.lowfreq: -4.5163 -1.6376 -0.0010 -0.0010 0.0001 4.8139 13.9450 23.6529 25.3151
frequency: 13.4957 23.5734 25.2178 39.7158 45.0519 58.0476 69.3053 76.7625 81.9488 87.6867 94.7120 97.4762 124.7762 138.3222 179.0748 184.8930 203.2059 213.4673 247.2197 265.0396 299.9675 310.4420 328.1433 359.7906 385.1882 411.2953 464.3531 492.2214 498.7478 564.1834 578.9821 610.7035 634.2861 640.4448 655.1499 696.7302 716.5633 757.6266 789.0782 795.2670 815.8174 818.8146 872.8529 891.6049 919.3333 967.9394 987.4515 1005.7856 1013.8153 1018.7299 1040.5821 1043.7551 1094.6234 1095.6322 1106.3727 1131.8346 1136.0854 1153.0960 1157.0993 1160.6983 1180.9906 1235.3582 1239.5470 1259.6213 1275.8615 1279.0076 1313.0250 1323.6320 1356.0424 1357.5008 1375.3315 1388.0733 1391.2412 1391.8054 1441.6459 1450.2678 1451.2327 1457.0779 1458.1497 1461.7943 1463.5510 1463.8677 1480.8518 1484.3769 1484.5504 1605.2525 1620.8244 1629.8933 1636.4937 2958.3368 2993.4438 2994.3069 2998.4898 2998.7744 3013.6428 3031.3338 3035.8769 3036.8892 3078.8099 3088.9166 3089.5122 3094.0703 3096.9256 3097.8758 3105.7021 3120.4714 3124.8325 3504.9464
redmass: 4.4046 4.4203 3.5933 4.2344 3.6969 4.3074 5.3571 2.8582 2.0162 2.4065 3.8199 2.8072 2.5962 4.7439 4.6255 2.5830 1.5888 1.5796 2.5003 2.2494 7.1547 3.1242 3.7543 3.8685 3.7540 3.6845 3.6056 3.0529 3.9068 3.1978 3.3054 4.9200 2.7995 3.1402 1.7104 3.7489 3.6881 2.4136 2.2586 1.7381 1.5151 1.7921 4.0342 3.7568 3.5957 2.4423 2.0535 2.7361 2.9652 2.3969 3.3593 1.6649 2.2204 2.1782 2.4948 1.9131 3.8385 1.9746 1.6892 1.9501 1.6997 1.8745 1.3245 1.7007 1.1328 1.1180 1.3425 1.5094 1.2824 1.3432 1.8717 1.2327 1.2353 1.2314 1.0972 1.0838 1.0815 1.0912 1.1037 1.2096 1.0431 1.0457 1.8056 1.0556 1.0530 8.0512 8.6260 7.6938 8.2741 1.0669 1.0360 1.0361 1.0646 1.0365 1.0828 1.0596 1.0904 1.0602 1.0955 1.0974 1.0972 1.1031 1.1026 1.0986 1.1004 1.1065 1.1072 1.0780
irintensity: 0.0740 1.4778 0.4837 0.4243 2.5257 0.4034 2.2895 3.9058 5.6439 0.6454 7.7113 0.9110 3.1067 5.4367 9.4324 0.9177 3.3099 20.3510 0.9642 6.0370 0.9660 14.3189 27.4316 1.7941 10.6786 2.9925 18.6081 8.7048 31.5541 5.9137 13.1124 8.5860 4.5918 41.4744 54.8818 15.4638 8.6997 7.2267 6.6362 10.0987 9.0777 7.8619 10.5441 14.2535 6.1758 4.2152 3.0628 61.4821 53.4873 48.7613 7.3165 7.6372 82.2223 25.1360 40.6827 84.3554 524.5422 45.2987 23.9980 60.1919 20.2909 51.1535 67.3794 25.1764 6.6989 3.9375 6.0888 172.1479 3.0631 25.9522 8.3580 67.6847 22.4027 23.3337 37.3287 37.3251 75.7805 6.3326 13.1784 136.6993 14.1662 14.4124 213.8673 14.8207 10.5775 263.7232 174.9435 16.8419 125.3405 33.1866 19.4377 15.1321 25.7935 8.2142 9.4531 28.9246 6.2452 21.6707 4.7714 35.3750 32.4748 1.0568 2.7167 11.7760 15.6324 32.1186 25.8252 72.7806
temp: 298.150 k
press: 1.00000 atm
elementType: 8 8 8 8 8 8 7 6 6 6 6 6 6 6 6 6 6 6 6 1 1 1 1 1 1 1 1 1 1 1 1 1 1 1 1 1 1 1
symmnumber: 1
zpe: 796175.2 jmol-1
zpe.correction: 0.303247 hartree
zpe.thermalcorrener: 0.325719 hartree
zpe.thermalcorrenthalpy: 0.326663 hartree
zpe.thermalcorrgfe: 0.246705 hartree
zpe.sumelectzpe: -973.307503 hartree
zpe.sumelectthermal: -973.285031 hartree
zpe.sumelectthermalent: -973.284087 hartree
zpe.sumelectthermalfe: -973.364045 hartree
dipole: -1.5219 1.7756 -3.5596
dipole: 4.2591
quadrupole: -94.6665 -103.6682 -124.2371
quadrupole: 1.3661 -11.1557 1.6623
quadrupole: 12.8575 3.8557 -16.7132 1.3661 -11.1557 1.6623
hfenergy: -973.6107502 hartree
pointgroup: C01 [X(C12H19N1O6)]
dipole: -0.3496847 -0.6619233 1.4991288 debye
polarizability: 194.5073943|16.6216706|147.2370245|-4.5743198|0.3571983|133.7515193 unknown
InChI: InChI=1S/C12H19NO6/c1-4-18-10(16)7-6-9(15)11(13-8(3)14)12(17)19-5-2/h11,13H,4-7H2,1-3H3
charge 0 multiplicity 1
38 atoms
O  3.17587 -0.529039 0.121828
O  0.105815 1.350309 1.447349
O  -4.218343 -1.410927 0.774226
O  1.681093 -1.252933 -1.51781
O  -3.835451 0.10719 -0.957322
O  3.670599 2.10639 -1.812905
N  2.268127 2.032896 0.024155
C  1.426468 1.014032 -0.568353
C  -1.010389 0.104719 -0.343703
C  0.145997 0.845298 0.293866
C  -2.048795 -0.399248 0.673254
C  2.103405 -0.376258 -0.729128
C  -3.430519 -0.517802 0.052024
C  3.374368 2.520119 -0.649366
C  3.924939 -1.8274 0.026949
C  4.193184 3.568762 0.091667
C  -5.639537 -1.568366 0.32472
C  3.283876 -2.88556 0.927182
C  -6.528278 -0.493737 0.956016
H  1.133584 1.290102 -1.599921
H  -1.510077 0.81386 -1.04055
H  -0.62227 -0.70539 -0.988908
H  -1.761913 -1.367406 1.116587
H  -2.114209 0.319373 1.514715
H  2.038564 2.306273 0.984861
H  3.937132 -2.142629 -1.030679
H  4.940044 -1.556417 0.356205
H  -5.6648 -1.516137 -0.77786
H  -5.905412 -2.581253 0.666297
H  3.748249 3.869203 1.055479
H  4.30198 4.460516 -0.548514
H  5.206825 3.171448 0.274843
H  3.21148 -2.527368 1.968486
H  2.276546 -3.152545 0.566429
H  3.904847 -3.80047 0.920225
H  -7.5841 -0.676966 0.682981
H  -6.249544 0.509684 0.592888
H  -6.448658 -0.512619 2.056591
