program: Gaussian 09
title: 000261061
version: EM64L-G09RevD.01
frameworkgroup: C1[X(C7H15NO2S)]
method: RPBEPBE
basis: SDD
operation: Freq
keyword: #p
keyword: freq=noraman
keyword: PBEPBE/SDD
title: #p freq=noraman PBEPBE/SDD
converged: YES YES NO NO
title: Mulliken charges:
elementType: S O O N C C C C C C C H H H H H H H H H H H H H H H
charge: 0.997039 -0.545821 -0.547984 -0.338524 -0.339834 -0.334970 -0.638196 -0.654564 -0.649617 0.022168 -0.509069 0.248587 0.217632 0.229735 0.215628 0.267430 0.275727 0.220825 0.261256 0.212532 0.265106 0.208757 0.211747 0.248047 0.228970 0.227394
chargesum: 0.00000
title: Mulliken charges with hydrogens summed into heavy atoms:
elementType: S O O N C C C C C C C
charge: 0.997039 -0.545821 -0.547984 -0.338524 0.126386 0.110393 -0.095039 0.040049 0.035993 0.270215 -0.052706
polarizability: 1.68137908e+02 6.02968917e+00 1.11881410e+02 3.97945522e+00 -3.00543269e+00 9.22935953e+01
1716.lowfreq: -11.2143 -0.0026 -0.0024 -0.0014 5.6241 10.2622 21.7347 40.7231 59.8325
frequency: 21.1458 40.3474 59.7865 72.5589 104.2899 111.9232 148.3928 171.6914 194.6785 216.5178 229.0700 244.2059 266.7392 281.3237 319.1398 373.2275 396.4496 412.0513 424.1124 472.7776 584.2560 679.1467 738.6389 749.7101 804.9712 814.0350 854.7496 900.1042 929.0843 952.3137 967.0453 998.4495 1005.5917 1055.8882 1072.0300 1081.6735 1083.2883 1158.5362 1177.5458 1193.0244 1201.2105 1274.8010 1297.6593 1302.9369 1344.8321 1352.3440 1382.1325 1390.5036 1399.7325 1434.6520 1437.6893 1442.0317 1465.7249 1474.0175 1488.9729 1490.3244 1639.4799 2974.3451 2986.3888 2989.7638 2994.1105 3029.7639 3055.2909 3061.7255 3080.3669 3086.1856 3099.8495 3112.3667 3120.0510 3134.0044 3159.3640 3212.2216
redmass: 4.6072 3.1145 3.2390 2.0432 2.3119 2.4034 3.2886 2.6271 3.4820 2.5125 4.1641 1.6861 2.1943 2.3195 3.7269 2.4063 2.8012 2.5269 3.4740 3.7386 4.0240 1.8130 1.8540 1.2521 13.7877 1.5750 1.7265 2.2034 2.6520 2.4618 1.3068 1.1823 2.9652 1.8770 1.7528 1.5511 1.5490 1.8370 3.0586 1.6094 1.2177 1.2265 1.2283 1.1493 1.1863 1.1830 1.2069 1.1939 1.1244 1.0803 1.1918 1.0859 1.0447 1.0465 1.0472 1.0493 4.2422 1.0600 1.0615 1.0373 1.0400 1.1008 1.0990 1.0568 1.0976 1.0961 1.0605 1.1022 1.1006 1.0956 1.1094 1.1152
irintensity: 2.8752 0.4169 1.5565 0.3461 0.6946 1.5725 1.4845 6.0863 5.9222 0.3132 15.2887 0.2278 3.0700 1.0970 7.6810 2.3991 10.0498 12.9764 27.8911 13.5156 123.0623 36.2021 44.7181 6.9052 53.5301 0.4442 14.2387 4.6125 51.8844 22.3037 75.0898 11.1585 34.8950 5.1992 9.3773 5.6933 5.4132 3.3145 44.2186 1.2349 6.5438 15.8313 1.4633 22.5234 2.7964 14.2928 15.4029 47.0105 10.8551 14.2757 8.6450 14.8233 2.5053 17.2181 14.0108 4.9180 1.4338 23.9106 32.0459 26.3481 36.1062 12.5251 5.5271 6.8862 58.6301 13.2822 3.7150 11.6332 27.2897 3.7685 2.0206 15.9136
temp: 298.150 k
press: 1.00000 atm
elementType: 16 8 8 7 6 6 6 6 6 6 6 1 1 1 1 1 1 1 1 1 1 1 1 1 1 1
symmnumber: 1
zpe: 557910.5 jmol-1
zpe.correction: 0.212497 hartree
zpe.thermalcorrener: 0.227536 hartree
zpe.thermalcorrenthalpy: 0.228480 hartree
zpe.thermalcorrgfe: 0.169309 hartree
zpe.sumelectzpe: -877.893587 hartree
zpe.sumelectthermal: -877.878548 hartree
zpe.sumelectthermalent: -877.877604 hartree
zpe.sumelectthermalfe: -877.936775 hartree
dipole: -0.5369 -1.5722 -3.9378
dipole: 4.2739
quadrupole: -62.0824 -77.5596 -81.1299
quadrupole: -1.0758 -0.0770 -0.2039
quadrupole: 11.5082 -3.9690 -7.5393 -1.0758 -0.0770 -0.2039
hfenergy: -878.106084 hartree
pointgroup: C01 [X(C7H15N1O2S1)]
dipole: 0.2214419 -0.1069629 1.6633874 debye
dipolederiv: 1.743284 0.0057134 0.0683579 0.0938898 1.1394161 0.0142885 -0.2241334 0.0246536 1.1032695 -0.6985828 0.0166413 -0.0504482 -0.0582035 -0.6336335 0.1931143 0.1391654 0.0901893 -0.5294694 -0.7493311 0.007457 -0.0268775 -0.036363 -0.6700187 -0.207373 0.0921804 -0.0969434 -0.5899637 -0.7262496 0.0142447 0.1440871 0.0708807 -0.5827951 0.0616021 0.323362 0.0459356 -0.4391601 0.151245 0.1163302 -0.117493 0.3828638 0.3829629 0.0101434 -0.3911022 -0.1046494 0.2145246 0.2355527 -0.1833207 -0.0433394 -0.4902171 0.3577369 -0.1187157 -0.1497414 0.0021424 0.2123582 0.3645911 0.0003587 0.0105956 0.0412112 -0.044803 0.0028219 -0.051317 -0.0550753 0.0054981 -0.0230609 -0.0635594 0.0863102 -0.0826234 0.0056767 0.0115408 0.1247166 0.0751232 -0.1488235 -0.0703285 0.1369191 0.0536814 0.1583796 -0.0335202 -0.0360599 0.0713348 -0.0833611 -0.0834533 -0.1249783 -0.01899 0.0320489 0.1703977 0.0832931 0.0479995 0.1943162 0.1383584 -0.2384005 -0.1332762 0.0284016 0.1823667 -0.0799928 0.0674421 0.1091238 0.1058837 0.0765409 -0.1949387 0.0193687 0.1069205 0.0635074 0.048036 -0.0568154 -0.0239568 0.0817768 0.03642 0.0503978 -0.069865 -0.0672333 -0.109652 -0.1111503 0.066088 0.0135116 -0.0515754 0.0219318 -0.073057 -0.04975 0.0449424 -0.1172854 0.0941952 0.0378392 -0.0328318 -0.0853297 -0.041303 -0.0997361 -0.0691302 -0.0900856 0.0891397 -0.0653024 -0.0355978 0.0457499 0.086503 -0.0071906 0.0749654 -0.0331605 0.0336029 -0.035444 0.0252347 0.0300462 0.0698465 -0.0135819 0.0477748 0.0198094 0.000616 0.0092916 0.0306561 -0.0484591 -0.0210108 -0.0526876 0.022673 -0.0254227 0.0451799 -0.0274656 0.1034225 0.03832 0.1538486 -0.0108915 -0.0436977 0.0107584 -0.0272159 0.0638178 0.045455 0.031018 -0.1198257 0.007317 0.0949029 -0.0248441 -0.0614006 -0.0237351 0.0107432 0.0025349 -0.1256696 0.0292148 -0.1506902 -0.1324682 0.0279507 0.0335828 0.0116045 0.0885096 0.095643 -0.0450623 -0.0822738 -0.0243713 0.1181035 -0.002784 -0.0305337 -0.019634 -0.0330876 -0.0789878 -0.0978978 0.0521624 -0.1570849 0.0128271 0.009435 0.0377738 -0.0123398 0.0724422 0.0333966 0.0760908 -0.0139076 0.1297836 -0.1410562 0.0857798 -0.017613 0.1019583 0.0641031 0.0653552 0.0324987 -0.0255266 -0.0306111 -0.0444552 -0.0462732 -0.0733687 -0.0575437 0.1332745 -0.0082671 -0.0396774 -0.0947769 -0.0295442 0.0732927 -0.0563124 -0.1618309 -0.0502454 0.1425969 0.1053914 -0.0323574 -0.043598 -0.0114247 -0.0625619 -0.0573717 -0.0124992 -0.0679732 0.1285996 unknown
polarizability: 168.5058674|-0.9983088|111.4735233|5.6656484|-2.8390104|92.333523 unknown
InChI: InChI=1S/C7H15NO2S/c1-4-7-11(9,10)8(5-2)6-3/h4H,1,5-7H2,2-3H3
charge 0 multiplicity 1
26 atoms
S  -0.373681 0.172313 -0.262124
O  -0.654231 1.592872 -1.012994
O  -0.245581 -1.217289 -1.115274
N  1.08876 0.42949 0.887663
C  1.872518 1.659825 0.574547
C  1.777782 -0.845382 1.236793
C  -1.82074 -0.091405 1.095077
C  2.585979 1.767874 -0.794626
C  2.768117 -1.471798 0.227382
C  -3.047012 -0.583824 0.418211
C  -4.116145 0.211895 0.144541
H  1.181072 2.514987 0.67715
H  2.606166 1.733181 1.402927
H  2.291481 -0.637389 2.197413
H  0.987572 -1.588297 1.460007
H  -1.346496 -0.807498 1.783012
H  -1.889216 0.916071 1.530222
H  3.32748 0.969649 -0.955368
H  1.846608 1.742484 -1.612816
H  3.11222 2.739685 -0.847901
H  2.277034 -1.630233 -0.746987
H  3.669528 -0.851519 0.089016
H  3.096019 -2.456269 0.611465
H  -3.053678 -1.638691 0.117317
H  -5.003388 -0.182836 -0.361865
H  -4.127568 1.274702 0.414111
