program: Gaussian 09
title: 000253156
version: EM64L-G09RevD.01
frameworkgroup: C1[X(C7H14O3)]
method: RPBEPBE
basis: SDD
operation: Freq
keyword: #pfreq=noraman
keyword: PBEPBE/SDD
title: #p freq=noraman PBEPBE/SDD
converged: YES YES NO NO
title: Mulliken charges:
elementType: O O O C C C C C C C H H H H H H H H H H H H H H
charge: -0.323176 -0.282423 -0.445199 -0.114197 -0.044783 0.369969 -0.311010 -0.729267 -0.681011 -0.699074 0.242170 0.211935 0.197726 0.217596 0.215225 0.239582 0.234449 0.225305 0.228075 0.218729 0.217889 0.235362 0.224030 0.352099
chargesum: 0.00000
title: Mulliken charges with hydrogens summed into heavy atoms:
elementType: O O O C C C C C C C
charge: -0.323176 -0.282423 -0.093100 0.127973 0.167152 0.369969 0.104312 -0.040010 -0.008902 -0.021793
polarizability: 9.53300130e+01 5.54169257e+00 8.59329972e+01 -6.66286135e-01 -1.34633307e+00 7.22444512e+01
1716.lowfreq: -18.5361 -12.9326 -0.0002 0.0007 0.0010 10.1784 57.0903 109.9462 128.5317
frequency: 57.0226 109.9360 128.5278 162.6784 177.2382 211.6316 217.7156 244.0566 289.5969 316.9185 342.4670 393.3847 465.9842 473.5439 502.2308 510.0778 601.6535 665.9847 708.2006 770.9576 821.3600 856.4557 913.5418 922.1297 956.1424 968.7855 983.2099 1008.7383 1020.4402 1067.7520 1124.1989 1139.7714 1161.5628 1180.0540 1207.6168 1239.6387 1256.9424 1287.4968 1312.7083 1342.6895 1357.8831 1378.1393 1386.5379 1388.9590 1394.3718 1450.2610 1452.1713 1462.4574 1465.6727 1470.2956 1471.5533 1483.2763 2959.0487 2961.0817 2997.0145 2998.5252 3003.1010 3041.9325 3069.3067 3094.4353 3098.2311 3101.8854 3106.9345 3107.1419 3113.6258 3506.8024
redmass: 4.5414 3.1735 2.8609 1.0493 3.1846 1.1023 1.0519 2.3850 2.8013 2.9112 3.1000 2.6449 3.4872 2.9277 2.5121 1.3068 3.7691 3.2350 5.5534 3.3954 3.1138 4.3860 2.0637 1.5965 2.4669 2.1917 1.3103 2.1342 2.4542 2.2170 1.8117 2.4117 1.4592 1.4925 2.7113 2.0422 2.1583 1.2714 1.2163 1.2900 1.4172 1.3003 1.3119 1.2258 1.2574 1.0502 1.0500 1.0572 1.0731 1.0658 1.0512 1.0492 1.0843 1.0669 1.0352 1.0365 1.0355 1.0863 1.0974 1.0988 1.1002 1.1000 1.0999 1.1001 1.1005 1.0648
irintensity: 0.5910 8.5760 3.5870 0.3408 0.5933 0.5255 0.5509 0.4157 2.2410 1.4730 2.0464 4.6136 2.1334 1.4057 11.0588 144.7101 1.2754 1.5593 27.9396 22.8745 35.1900 8.2684 1.5194 3.7844 78.3554 63.5562 0.9371 41.2679 56.7995 34.6899 9.9080 8.5636 51.5325 4.3022 130.5199 28.6590 20.4770 27.0843 1.8874 9.2019 17.3019 40.3111 28.8548 27.6063 18.8858 2.1510 1.9706 7.7341 7.5934 1.4939 18.6226 10.3039 52.2694 44.0080 15.5785 18.4211 10.4084 21.1904 44.0694 22.2643 2.7457 22.7884 18.8169 42.9366 28.6432 10.6721
temp: 298.150 k
press: 1.00000 atm
elementType: 8 8 8 6 6 6 6 6 6 6 1 1 1 1 1 1 1 1 1 1 1 1 1 1
symmnumber: 1
zpe: 534980.1 jmol-1
zpe.correction: 0.203763 hartree
zpe.thermalcorrener: 0.215235 hartree
zpe.thermalcorrenthalpy: 0.216179 hartree
zpe.thermalcorrgfe: 0.167313 hartree
zpe.sumelectzpe: -499.967461 hartree
zpe.sumelectthermal: -499.955989 hartree
zpe.sumelectthermalent: -499.955044 hartree
zpe.sumelectthermalfe: -500.003911 hartree
dipole: -1.5059 2.1040 -0.4068
dipole: 2.6192
quadrupole: -63.6114 -63.0976 -61.7336
quadrupole: 9.6774 0.2203 -3.5694
quadrupole: -0.7972 -0.2834 1.0806 9.6774 0.2203 -3.5694
hfenergy: -500.1712237 hartree
pointgroup: C01 [X(C7H14O3)]
dipole: -0.7232939 0.4955347 -0.5414393 debye
dipolederiv: -1.1181689 -0.1093412 -0.0247854 -0.1582852 -0.5767799 0.0221227 0.0327697 0.0332838 -0.4453832 -0.7551967 -0.2385075 0.0853912 -0.2180589 -0.8445961 0.1328099 0.0658079 0.1591072 -0.4819345 -0.3921639 0.2135378 -0.0450516 0.2535684 -0.6267797 0.0789476 -0.1086545 0.0822425 -0.6069602 0.4587144 0.1352714 -0.0231382 0.3435473 0.2061223 0.0017332 -0.0578669 0.066666 0.223415 0.4560623 0.2278017 -0.0748568 0.0382057 0.3490892 -0.0710881 -0.0806597 -0.1508728 0.4106708 1.1264225 0.2064035 0.0513442 0.1913594 0.7826215 -0.1275694 -0.0138124 -0.0452807 0.6841223 0.2754088 -0.1370862 -0.0555367 -0.1710936 0.4807616 -0.0184373 -0.0039837 -0.0774054 0.2589806 0.0214808 -0.0395109 -0.0183018 -0.0689726 -0.1068636 -0.0106219 -0.0102888 -0.0219912 0.0493395 -0.1146546 -0.0732667 -0.1095956 -0.0657806 -0.0408178 -0.0060615 -0.1511738 -0.0734546 -0.1734257 -0.0308538 -0.0414428 0.0089284 -0.0420758 -0.0044676 0.0560638 0.0812974 0.0822907 -0.2153823 -0.0473538 -0.013911 0.0742399 -0.0149071 0.0521645 -0.0444904 0.0939468 -0.0201533 -0.0792725 -0.0489265 -0.0151079 -0.0750614 0.0051262 0.0095948 -0.0346502 -0.0351775 0.0306972 -0.2122581 -0.0326036 0.1134937 0.106294 0.0738528 -0.0331172 -0.0416323 0.0859164 -0.0751038 -0.078576 -0.0610098 -0.1274154 0.019055 -0.076659 -0.0502435 0.0243437 0.0168513 0.0437289 0.0714266 -0.0494946 -0.0790927 0.1091794 -0.0350787 0.0629798 0.0071785 0.1087786 0.0288295 0.0195149 -0.0133589 0.140371 -0.0392277 0.0804897 -0.0313666 0.027705 -0.0434241 0.0182666 0.0969025 0.0801419 -0.0187519 -0.0503077 -0.0155616 0.0931524 0.0204468 -0.0742204 -0.0413844 -0.1031667 0.0762563 -0.032949 0.071304 -0.0197265 0.062986 0.0996933 0.0416091 0.0742187 -0.0954468 0.0857879 0.0034067 -0.0054723 -0.033086 -0.1302294 -0.0243062 -0.0201922 -0.004381 0.1008187 -0.1329318 0.0337098 0.0216212 0.0662906 0.0784624 -0.0250881 0.0552104 -0.0316266 0.0751449 0.0992344 -0.013691 0.0080515 -0.0447354 -0.129709 0.0215862 0.0146184 -0.0226019 0.0810621 -0.0050576 -0.0415382 -0.1199115 -0.0456649 0.0798921 -0.049361 -0.0997892 -0.0318574 -0.0221381 -0.0972223 0.0586823 0.0640369 0.0881364 0.0744401 -0.0212769 0.0421224 0.0117324 0.0787094 0.2194876 -0.1510655 0.0218011 -0.1308906 0.2427038 -0.0180474 0.0603149 -0.0349506 0.3638367 unknown
polarizability: 91.4071091|8.158559|86.9686824|0.9229051|-5.4350307|75.13167 unknown
InChI: InChI=1S/C7H14O3/c1-5-6(4-8)10-7(2,3)9-5/h5-6,8H,4H2,1-3H3
charge 0 multiplicity 1
24 atoms
O  0.123187 -1.147157 -0.197642
O  -1.081356 0.854752 0.194413
O  2.606454 -1.116579 1.073842
C  1.034396 0.013749 -0.437341
C  0.058512 1.18637 -0.701799
C  -1.244417 -0.610973 0.141892
C  1.945071 0.15926 0.794378
C  0.538758 2.597093 -0.367914
C  -2.202958 -1.03311 -0.98036
C  -1.660042 -1.092393 1.530943
H  1.637876 -0.245743 -1.325347
H  -0.283375 1.136518 -1.75732
H  1.349204 0.50143 1.667019
H  2.758014 0.881416 0.605535
H  1.399481 2.875561 -1.002316
H  -0.272793 3.321287 -0.55185
H  0.835374 2.677893 0.690952
H  -1.892911 -0.59369 -1.943735
H  -2.198543 -2.131524 -1.085675
H  -3.229779 -0.698924 -0.751299
H  -1.744964 -2.192363 1.541643
H  -0.911833 -0.782081 2.278455
H  -2.636899 -0.658456 1.805719
H  1.899043 -1.813735 1.015807
