program: Gaussian 09
title: 000023791
version: EM64L-G09RevD.01
frameworkgroup: C1[X(C13H16ClNS)]
method: RPBEPBE
basis: SDD
operation: Freq
keyword: #p
keyword: freq=noraman
keyword: PBEPBE/SDD
title: #p freq=noraman PBEPBE/SDD
converged: YES YES NO NO
title: Mulliken charges:
elementType: Cl S N C C C C C C C C C C C C C H H H H H H H H H H H H H H H H
charge: -0.084473 0.255875 -0.129087 -0.470732 0.499032 -0.313553 -0.345438 0.380508 -0.384670 -0.757382 -0.580198 -0.673830 -0.393818 -0.264809 -0.239330 -0.239690 0.209258 0.233209 0.228311 0.227897 0.238629 0.199193 0.280893 0.265565 0.273244 0.211379 0.222544 0.216233 0.234192 0.243998 0.226983 0.230066
chargesum: 0.00000
title: Mulliken charges with hydrogens summed into heavy atoms:
elementType: Cl S N C C C C C C C C C C C C C
charge: -0.084473 0.255875 -0.129087 -0.028265 0.499032 0.142654 0.092384 0.380508 -0.384670 -0.476490 -0.041388 -0.023674 -0.159625 -0.020811 -0.012347 -0.009624
polarizability: 2.30679091e+02 1.07742425e+01 1.61466658e+02 -2.27733146e+00 -2.81255461e+01 1.25121469e+02
1716.lowfreq: -2.7978 -0.0028 -0.0025 -0.0021 2.6758 7.4928 21.0882 28.5167 40.0852
frequency: 20.9941 28.5060 40.0480 63.3641 85.0967 115.9656 135.6151 157.6277 192.4788 203.1800 227.1701 247.3376 262.0701 307.9243 362.6265 382.4589 394.6864 419.0881 473.6606 481.5399 495.3509 547.2610 590.2569 612.0761 653.5373 688.9107 733.0709 753.6526 761.9332 773.2894 784.9681 796.6159 812.8456 828.7841 861.5192 938.8146 944.5060 982.8660 989.4174 1008.1523 1019.3314 1021.0586 1047.4521 1064.2790 1081.9039 1095.2975 1117.6309 1134.9318 1148.8457 1170.5103 1175.9748 1221.3471 1246.3947 1258.0123 1272.4884 1285.9873 1299.5849 1330.5055 1360.5112 1371.8024 1385.1208 1387.9663 1390.5647 1429.4602 1451.2193 1456.9048 1464.5674 1469.3448 1474.6124 1485.8223 1486.9250 1546.5471 1577.2270 1603.0573 2850.9689 2876.3877 2936.5977 2983.0913 2998.7491 3038.8852 3059.9295 3065.1384 3078.4597 3087.7617 3127.7437 3138.3476 3151.6809 3151.7289 3167.4945 3234.0880
redmass: 6.5933 6.9101 3.9901 2.9574 2.5477 2.5862 4.1602 2.4501 6.5075 4.9515 1.7127 2.3546 2.9814 2.7121 4.6962 3.0495 4.0536 2.9745 4.2718 4.1862 5.7183 4.6848 3.6868 5.6576 6.4010 6.6714 2.4167 5.3915 1.5950 1.1418 2.8354 1.1909 1.3628 2.9854 1.4037 2.0422 1.5129 1.3258 1.6874 2.0868 2.7979 2.3625 2.8637 3.2693 2.6136 2.1465 1.6089 1.4865 1.3567 1.6958 1.1075 1.8363 1.1842 1.5261 1.2706 1.2496 1.2715 1.8269 1.3325 1.4507 1.7083 5.5124 1.2696 2.6128 1.1094 2.4023 1.0557 1.2004 1.0641 1.0743 1.0733 5.4654 6.9561 6.7208 1.0710 1.0713 1.0699 1.0359 1.0857 1.0889 1.0790 1.0700 1.0980 1.1003 1.0857 1.0889 1.0993 1.1073 1.1004 1.0951
irintensity: 0.4263 0.6585 0.2696 0.0276 1.9080 1.1757 1.5096 1.7404 2.5302 4.8579 0.5894 1.7148 2.5156 1.0951 3.9258 5.0742 1.4388 8.3815 1.1824 1.9166 4.0604 7.9170 1.0918 5.6535 110.4649 2.8434 27.9634 12.7858 58.3049 4.9437 2.5851 14.4012 35.9361 16.7773 3.1771 7.5782 0.7302 0.1004 8.4449 10.9482 6.4110 14.3601 21.6249 10.7809 11.9288 19.3035 19.9411 1.9903 3.4077 18.7820 3.1495 30.2022 9.3141 8.5147 11.5065 17.9404 11.8821 20.9735 1.0688 2.2528 5.0338 6.5395 21.8991 18.6240 7.5662 15.4355 1.7470 8.2685 0.0832 11.9962 15.8038 1.6339 0.4207 0.3779 52.3608 101.8144 50.0267 27.3053 17.7799 7.5144 9.1172 24.1441 51.0803 44.2287 2.6615 5.9070 17.1744 21.2247 26.5388 1.0054
temp: 298.150 k
press: 1.00000 atm
elementType: 17 16 7 6 6 6 6 6 6 6 6 6 6 6 6 6 1 1 1 1 1 1 1 1 1 1 1 1 1 1 1 1
symmnumber: 1
zpe: 678518.9 jmol-1
zpe.correction: 0.258434 hartree
zpe.thermalcorrener: 0.274656 hartree
zpe.thermalcorrenthalpy: 0.275600 hartree
zpe.thermalcorrgfe: 0.212043 hartree
zpe.sumelectzpe: -1416.649517 hartree
zpe.sumelectthermal: -1416.633295 hartree
zpe.sumelectthermalent: -1416.632351 hartree
zpe.sumelectthermalfe: -1416.695908 hartree
dipole: -1.6810 0.4089 1.9985
dipole: 2.6433
quadrupole: -118.4058 -108.7950 -110.6392
quadrupole: 10.5929 4.7566 -3.9429
quadrupole: -5.7925 3.8183 1.9741 10.5929 4.7566 -3.9429
hfenergy: -1416.9079511 hartree
pointgroup: C01 [X(C13H16Cl1N1S1)]
dipole: 0.6326673 0.0868583 -0.8207707 debye
polarizability: 231.4952882|-6.7217516|167.4971587|-5.4692632|22.1343932|118.2747707 unknown
InChI: InChI=1S/C13H16ClNS/c1-2-15(8-7-14)9-11-10-16-13-6-4-3-5-12(11)13/h3-6,10H,2,7-9H2,1H3
charge 0 multiplicity 1
32 atoms
Cl -5.31302 -1.562047 1.468504
S  1.877477 1.985189 1.252063
N  -2.105541 0.182941 -0.502405
C  -0.88805 -0.650506 -0.371342
C  0.327364 0.119687 0.113912
C  -3.361317 -0.580155 -0.313485
C  -2.086044 1.076744 -1.692257
C  1.694911 -0.374011 -0.023834
C  2.667492 0.513126 0.540543
C  0.264765 1.334392 0.760828
C  -3.755918 -0.516463 1.168019
C  -3.004598 2.302344 -1.53896
C  2.149663 -1.581548 -0.62396
C  4.047454 0.229813 0.517799
C  3.526284 -1.872577 -0.652313
C  4.471608 -0.973756 -0.085506
H  -0.636409 -1.158467 -1.33693
H  -1.101785 -1.463757 0.350599
H  -3.269699 -1.641651 -0.634368
H  -4.167948 -0.133296 -0.919714
H  -1.045618 1.42621 -1.81887
H  -2.354241 0.514968 -2.621102
H  -0.632771 1.906053 0.989363
H  -2.986061 -0.940254 1.830159
H  -4.012552 0.505874 1.478908
H  -4.063937 2.015389 -1.407084
H  -2.702285 2.902331 -0.662401
H  -2.943273 2.941528 -2.438919
H  1.430053 -2.283576 -1.059864
H  4.775444 0.920501 0.955419
H  3.876389 -2.801726 -1.114978
H  5.539364 -1.216198 -0.115427
