program: Gaussian 09
title: 000253144
version: EM64L-G09RevD.01
frameworkgroup: C1[X(C9H7N3S)]
method: RPBEPBE
basis: SDD
operation: Freq
keyword: #pfreq=noraman
keyword: PBEPBE/SDD
title: #p freq=noraman PBEPBE/SDD
converged: NO NO NO NO
title: Mulliken charges:
elementType: S N N N C C C C C C C C C H H H H H H H
charge: 0.318310 -0.305645 -0.071994 -0.141983 0.600923 -0.393692 -0.181564 0.225632 -0.298441 -0.269023 -0.755231 -0.217963 -0.235472 0.251375 0.252304 0.236326 0.236358 0.274301 0.236324 0.239155
chargesum: 0.00000
title: Mulliken charges with hydrogens summed into heavy atoms:
elementType: S N N N C C C C C C C C C
charge: 0.318310 -0.305645 -0.071994 -0.141983 0.600923 -0.393692 -0.181564 0.225632 -0.047066 -0.016719 -0.008247 0.018362 0.003682
polarizability: 1.81640165e+02 -4.28277069e+00 1.45778225e+02 -8.19946623e-03 -4.85832216e-04 5.45719110e+01
1716.lowfreq: -5.6605 -0.0010 -0.0003 0.0004 2.8785 7.3637 106.6916 107.2775 184.6424
frequency: 106.6912 107.2664 184.6411 192.4205 197.8048 288.6615 307.8040 310.7470 413.9287 429.6970 432.7365 485.3468 526.2141 537.7400 626.6350 664.3325 671.5492 691.3209 709.9619 727.5874 757.6576 858.4556 928.1130 941.6982 953.0896 984.4265 989.1480 999.1718 1020.8087 1048.5326 1061.8661 1130.4082 1176.0786 1217.0870 1252.9080 1285.1891 1341.8533 1391.9280 1396.4133 1405.1698 1437.5333 1455.8546 1468.1071 1478.5292 1491.5986 1586.7714 1603.1038 2982.3481 3059.7219 3119.0446 3142.9637 3154.7851 3167.9934 3178.9872
redmass: 6.1431 3.3278 3.6374 1.1432 4.5485 6.5885 5.1447 4.0636 9.7046 3.1176 10.9161 10.8868 4.9593 3.9967 9.1345 6.4741 7.5913 6.7797 6.1999 3.4835 1.3564 1.3574 8.8036 1.3799 8.7842 1.3246 1.8728 7.6598 2.9869 1.4491 2.9339 1.5439 1.0746 4.4080 4.1485 1.8024 5.9731 3.4235 1.4053 4.7463 2.5607 2.2744 1.0441 1.7622 3.4950 6.9385 7.0973 1.0386 1.0987 1.0964 1.0860 1.0906 1.0952 1.0999
irintensity: 2.7661 1.4309 0.9081 0.0285 1.3291 2.5945 0.6436 1.2648 3.7538 9.9389 1.8184 0.3076 5.3483 0.1265 0.6669 7.8725 0.5113 2.1409 0.8335 6.2358 91.9647 0.1164 4.9236 1.7785 5.0849 0.0058 2.3606 1.3105 17.4509 3.0716 5.7328 3.2189 0.8728 21.5799 3.8571 0.7199 14.8539 6.1443 9.2552 181.1229 33.6230 39.2180 20.1555 66.7014 47.0994 1.8409 2.4548 16.7468 15.7939 4.5485 0.5127 5.5593 12.6620 10.7635
temp: 298.150 k
press: 1.00000 atm
elementType: 16 7 7 7 6 6 6 6 6 6 6 6 6 1 1 1 1 1 1 1
symmnumber: 1
zpe: 377304.8 jmol-1
zpe.correction: 0.143708 hartree
zpe.thermalcorrener: 0.153827 hartree
zpe.thermalcorrenthalpy: 0.154771 hartree
zpe.thermalcorrgfe: 0.107995 hartree
zpe.sumelectzpe: -908.545600 hartree
zpe.sumelectthermal: -908.535480 hartree
zpe.sumelectthermalent: -908.534536 hartree
zpe.sumelectthermalfe: -908.581312 hartree
dipole: -5.9200 3.9265 0.0011
dipole: 7.1038
quadrupole: -90.3996 -74.3638 -85.6745
quadrupole: 8.9375 0.0029 -0.0002
quadrupole: -6.9203 9.1155 -2.1952 8.9375 0.0029 -0.0002
hfenergy: -908.6893073 hartree
pointgroup: C01 [X(C9H7N3S1)]
dipole: 2.4429012 1.3576884 -0.0004423 debye
dipolederiv: -0.4334121 0.0122405 0.0000308 0.0008631 -0.1210839 -0.000022 0.0000749 -0.0000617 0.1193543 -1.059235 -0.1488705 0.000117 -0.1743729 -0.4076382 0. 0.0000585 0.0000145 0.0447715 -0.7116059 0.2930505 0.0000813 0.1914794 -0.3015995 0.0000673 0.0001621 -0.0000852 -0.1904702 -0.4165891 -0.1330532 -0.0001188 -0.1193908 -0.0643663 0.0000339 -0.0000421 0.000085 -0.260969 0.7191928 0.1070625 -0.0000383 -0.1277732 -0.1252815 -0.0000058 -0.0000313 -0.000024 0.0979302 0.1928005 0.4098693 0.0000308 0.5648679 0.3020806 0.0000084 -0.0000127 0.0000312 -0.1065883 1.0363227 -0.3358917 -0.000071 0.064807 0.2807957 0.000017 -0.0001864 0.0000494 -0.0180941 0.6092817 -0.0487441 -0.0000467 -0.3084371 0.347065 -0.0001312 -0.000055 -0.0000033 0.0485984 -0.0182695 -0.0157395 -0.0000009 -0.0581425 0.0201579 -0.000004 0.0000074 0.000006 -0.1443502 -0.0408232 -0.1479275 -0.0000186 -0.1717299 0.0035376 0.0000107 -0.0000377 0.0000029 -0.1063969 0.0021136 -0.0170212 0.0000573 0.0460648 -0.0945583 0.0000222 0.0000632 0.0000142 0.109162 -0.072988 0.0633927 -0.0000077 0.0957874 0.0493411 0.0000047 -0.0000017 0.0000072 -0.1572202 0.0316595 -0.0064137 -0.0000109 -0.0375413 0.0099801 0.0000066 -0.0000101 -0.0000007 -0.1583135 0.0651588 0.0763874 0.0000089 0.0566043 -0.0275575 -0.0000054 0.0000091 -0.0000159 0.1617552 0.0801877 0.0276955 0.0000053 0.0753363 -0.0291723 -0.0000133 0.0000182 -0.0000071 0.1639152 0.0767697 -0.076861 -0.1031601 -0.0036217 0.0035014 -0.0290972 -0.0796735 -0.0665498 -0.0326152 0.0769209 -0.0767565 0.1030722 -0.0035781 0.0035349 0.0291061 0.0795823 0.066565 -0.032744 -0.0514527 0.0912825 0.0000516 0.0056023 0.1041675 0.000006 0.0000542 -0.0000276 0.1317556 0.0230612 -0.0799498 0.0000039 -0.0971988 -0.0398423 -0.0000009 0.0000036 0. 0.1627406 -0.1090937 0.0062477 0.0000138 0.0003739 0.0869384 -0.0000032 0.0000169 0. 0.1677786 unknown
polarizability: 182.0889079|1.4310755|145.3294822|-0.0081363|0.0011263|54.571911 unknown
InChI: InChI=1S/C9H7N3S/c1-6-10-11-9-12(6)7-4-2-3-5-8(7)13-9/h2-5H,1H3
charge 0 multiplicity 1
20 atoms
S  0.031618 -2.402117 -0.00006
N  -0.829796 0.139164 0.000157
N  -2.644088 -1.234717 0.000188
N  -3.073676 0.136768 0.000634
C  0.577646 0.277986 0.000095
C  1.22095 -0.995098 0.00001
C  -1.306698 -1.184716 0.000132
C  -1.98037 0.939987 0.000125
C  1.33911 1.464713 0.00008
C  2.623267 -1.096066 -0.000071
C  -2.010765 2.43408 -0.000071
C  2.747429 1.362292 0.000011
C  3.384719 0.096583 -0.000061
H  0.852144 2.443931 0.000126
H  3.117169 -2.072576 -0.000149
H  -1.520265 2.858456 0.895765
H  -1.520913 2.858245 -0.896367
H  -3.065002 2.750821 0.00027
H  3.351833 2.27508 0.000007
H  4.477689 0.035582 -0.00012
