program: Gaussian 09
title: 000253128
version: EM64L-G09RevD.01
frameworkgroup: C1[X(C10H12BrNO3S)]
method: RPBEPBE
basis: SDD
operation: Freq
keyword: #p
keyword: freq=noraman
keyword: PBEPBE/SDD
title: #p freq=noraman PBEPBE/SDD
converged: YES YES NO NO
title: Mulliken charges:
elementType: Br S O O O N C C C C C C C C C C H H H H H H H H H H H H
charge: 0.045307 0.905124 -0.246201 -0.532493 -0.529546 -0.266637 -0.397549 -0.415007 -0.290135 -0.290224 -0.007526 -0.214673 -0.268298 -0.160381 -0.158703 -0.211670 0.236919 0.253081 0.251886 0.276249 0.221264 0.240531 0.218631 0.225597 0.282323 0.303651 0.263709 0.264770
chargesum: 0.00000
title: Mulliken charges with hydrogens summed into heavy atoms:
elementType: Br S O O O N C C C C C C C C C C
charge: 0.045307 0.905124 -0.246201 -0.532493 -0.529546 -0.266637 0.092451 0.113128 0.171660 0.154003 -0.007526 0.067650 0.035354 0.103329 0.106067 -0.211670
polarizability: 2.46896170e+02 -1.10589679e+01 1.28134143e+02 8.05610224e-01 -1.51353233e+01 1.29228051e+02
1716.lowfreq: -0.0008 -0.0004 0.0019 5.3534 6.2081 12.7975 30.7354 31.9518 48.1001
frequency: 30.2604 31.9101 47.7558 89.0521 105.5725 120.5691 166.6013 182.0455 203.8843 228.1826 245.1169 271.1075 305.2505 318.2392 337.3957 377.6110 393.9215 407.4733 417.0734 439.8135 473.5327 497.9720 521.7734 610.8689 623.8884 688.4790 704.0012 782.6593 791.6357 807.4363 813.1839 822.7956 844.6115 876.6458 924.4173 957.9307 979.0147 983.0245 994.9677 1015.4247 1025.8408 1047.8002 1055.3400 1063.5795 1100.4459 1105.7164 1116.6725 1178.6645 1183.4896 1241.8192 1258.2192 1283.5930 1290.4743 1319.5030 1335.8726 1340.3747 1369.4863 1373.6451 1376.8837 1420.5567 1428.6890 1447.2943 1454.4473 1460.8820 1562.8344 1590.3071 2957.9124 2984.2319 2991.8832 2997.2880 3058.7266 3066.8040 3083.0347 3086.3215 3154.2130 3163.7413 3177.8784 3182.6203
redmass: 6.4721 4.0676 5.1017 7.8059 6.1747 7.1224 4.5049 12.9563 4.7136 7.4688 5.3514 5.0598 3.5564 3.1630 6.7825 4.2926 3.2425 2.9038 3.2146 6.7031 3.2596 3.7617 5.0793 7.0748 2.1197 7.0834 4.0613 4.8419 13.7346 2.0822 2.6783 1.3479 1.3307 2.8736 16.4572 1.3536 4.9728 1.4772 2.6298 2.3009 2.0048 7.4352 1.8022 4.4522 2.1129 1.3630 5.4215 1.1254 1.0718 1.1833 1.2248 1.2292 1.1552 1.2458 1.2560 1.2704 1.2389 2.8113 11.0972 1.0813 1.0802 2.0926 1.0791 1.0888 6.0891 8.1548 1.0679 1.0652 1.0591 1.0610 1.1012 1.1009 1.0980 1.1021 1.0899 1.0891 1.0960 1.0978
irintensity: 0.0799 0.1525 0.2767 2.2722 1.1166 3.3075 1.5178 2.5364 7.8337 5.1248 8.3287 7.7889 3.6519 16.2961 46.6978 1.0519 6.2361 0.0732 3.7993 18.1285 1.5612 17.6980 87.7451 0.5756 87.6826 55.7017 5.6083 5.5949 96.6795 23.0831 40.2653 18.4159 33.6099 3.2101 74.7875 0.0907 50.0695 5.1313 0.5756 13.2428 19.8911 71.7215 1.3853 28.6161 11.4554 5.8524 8.1891 10.2730 1.2201 26.3290 4.4282 1.4633 14.8934 0.6156 2.3094 4.6615 3.3340 18.2965 4.6397 27.8951 10.0670 58.5123 5.6809 16.6998 38.2999 0.8447 34.3068 21.8677 9.4202 18.2715 16.6539 4.9255 31.1007 28.3882 5.5652 0.8686 1.7848 2.4790
temp: 298.150 k
press: 1.00000 atm
elementType: 35 16 8 8 8 7 6 6 6 6 6 6 6 6 6 6 1 1 1 1 1 1 1 1 1 1 1 1
symmnumber: 1
zpe: 542926.3 jmol-1
zpe.correction: 0.206790 hartree
zpe.thermalcorrener: 0.222658 hartree
zpe.thermalcorrenthalpy: 0.223602 hartree
zpe.thermalcorrgfe: 0.161424 hartree
zpe.sumelectzpe: -1078.801856 hartree
zpe.sumelectthermal: -1078.785988 hartree
zpe.sumelectthermalent: -1078.785043 hartree
zpe.sumelectthermalfe: -1078.847221 hartree
dipole: 1.8781 -1.9627 -2.5795
dipole: 3.7461
quadrupole: -119.4518 -114.0196 -112.2087
quadrupole: -0.7333 7.2051 -8.1916
quadrupole: -4.2251 1.2071 3.0180 -0.7333 7.2051 -8.1916
hfenergy: -1079.0086456 hartree
pointgroup: C01 [X(C10H12Br1N1O3S1)]
dipole: -0.7795924 -1.2420542 -0.1472495 debye
polarizability: 244.820056|0.7254402|114.7151048|17.995281|-6.7115043|144.7232028 unknown
InChI: InChI=1S/C10H12BrNO3S/c11-9-1-3-10(4-2-9)16(13,14)12-5-7-15-8-6-12/h1-4H,5-8H2
charge 0 multiplicity 1
28 atoms
Br -5.696074 -0.25088 -0.599296
S  0.729736 0.925348 0.358168
O  4.105026 -1.316393 -0.420593
O  1.247457 1.674193 -1.007221
O  0.937495 1.612384 1.821758
N  1.380389 -0.876181 0.573694
C  1.656654 -1.506492 -0.757227
C  2.56801 -0.888774 1.484449
C  3.007807 -1.091245 -1.379624
C  3.889756 -0.504148 0.790538
C  -1.097822 0.552839 0.089705
C  -1.847201 0.03203 1.157271
C  -1.64442 0.862001 -1.165307
C  -3.223615 -0.208336 0.948741
C  -3.022615 0.621418 -1.370695
C  -3.789004 0.086236 -0.313006
H  0.818429 -1.288173 -1.444388
H  1.656326 -2.596267 -0.55965
H  2.624091 -1.927978 1.862828
H  2.355074 -0.217413 2.33581
H  3.245741 -1.721193 -2.252527
H  2.976367 -0.025537 -1.684557
H  3.88705 0.576064 0.528313
H  4.752071 -0.714904 1.444085
H  -1.380022 -0.177383 2.123867
H  -1.013742 1.294161 -1.949358
H  -3.840975 -0.615426 1.753882
H  -3.485287 0.85095 -2.334161
