program: Gaussian 09
title: 000253127
version: EM64L-G09RevD.01
frameworkgroup: C1[X(C7H15NO2)]
method: RPBEPBE
basis: SDD
operation: Freq
keyword: #p
keyword: freq=noraman
keyword: PBEPBE/SDD
title: #p freq=noraman PBEPBE/SDD
converged: YES YES NO NO
title: Mulliken charges:
elementType: O O N C C C C C C C H H H H H H H H H H H H H H H
charge: -0.275325 -0.256329 -0.101243 0.030631 -0.367804 -0.707730 -0.616905 -0.615636 0.286632 -0.759891 0.236162 0.223050 0.207854 0.240231 0.215484 0.223382 0.237098 0.194883 0.221935 0.223054 0.191515 0.226517 0.246498 0.251291 0.244645
chargesum: 0.00000
title: Mulliken charges with hydrogens summed into heavy atoms:
elementType: O O N C C C C C C C
charge: -0.275325 -0.256329 -0.101243 0.266793 0.063099 -0.028634 0.037012 0.025451 0.286632 -0.017456
polarizability: 1.09049956e+02 2.81190418e+00 8.77737653e+01 -2.72612255e+00 2.42887902e+00 7.55011881e+01
1716.lowfreq: -47.1991 -18.0878 -10.1652 -0.0006 0.0005 0.0007 6.9116 22.9731 47.1736
frequency: -47.1781 22.1251 47.1294 68.5381 99.8264 172.8765 192.9333 207.7680 229.7847 238.6954 289.2176 300.1714 368.4284 397.7282 415.2795 447.2143 484.2171 579.0769 613.2148 783.7046 820.8164 871.0902 909.6760 932.6448 998.9430 1036.0350 1038.7248 1043.0400 1045.8407 1083.2328 1093.6818 1136.8634 1156.5051 1200.2773 1206.6660 1264.9319 1283.3564 1311.9437 1337.1441 1364.9478 1380.5940 1383.8876 1421.8090 1442.2750 1455.9097 1458.3253 1460.0467 1464.5347 1468.2237 1473.4268 1475.1704 1477.6050 1487.0882 1633.8272 2858.3711 2871.9551 2896.4887 2990.7423 3008.0068 3018.4878 3027.1953 3030.8976 3045.6282 3077.1662 3091.0838 3093.3798 3095.8699 3100.4310 3139.1215
redmass: 1.0721 2.9534 4.8361 2.8152 2.8896 2.3109 2.0073 1.1485 1.2085 1.3746 2.9526 2.7131 3.4771 2.0228 2.3767 2.6254 3.0821 3.3446 4.7948 3.4410 3.8145 3.1035 1.9418 2.1523 1.7694 1.6481 1.8937 2.0299 1.6582 1.3355 1.5250 1.5501 2.0576 3.3980 2.1813 2.2156 1.6060 1.3958 1.3895 1.3706 1.2444 1.2505 1.1406 1.1437 1.0699 1.0466 1.0468 1.0854 1.0456 1.0572 1.0557 1.0674 1.0546 10.3138 1.0563 1.0570 1.0680 1.0354 1.0364 1.0733 1.0828 1.0787 1.0900 1.1008 1.1001 1.0994 1.0972 1.0999 1.1012
irintensity: 1.5931 0.3450 2.8620 1.7938 1.0741 1.1219 5.4762 1.0091 1.7011 1.3401 4.8568 1.7530 17.8909 0.1894 0.7528 6.9056 4.6459 6.0904 3.9025 3.6104 10.6189 15.3619 19.3030 23.4099 39.8810 12.6768 36.7736 106.9250 6.5886 6.6004 33.5352 3.9426 5.6756 287.2990 46.6962 7.9576 7.4737 3.4012 2.0767 1.4371 46.0947 34.0059 2.9798 1.9210 14.7150 16.3158 8.4782 9.8760 8.3749 14.4068 28.4520 9.4511 10.5369 183.0902 95.0521 122.5431 104.3350 18.6748 4.1824 41.7677 16.8995 35.3305 16.4209 32.9280 34.0609 37.1961 8.2288 17.0936 9.8471
temp: 298.150 k
press: 1.00000 atm
elementType: 8 8 7 6 6 6 6 6 6 6 1 1 1 1 1 1 1 1 1 1 1 1 1 1 1
symmnumber: 1
zpe: 561777.3 jmol-1
zpe.correction: 0.213970 hartree
zpe.thermalcorrener: 0.226182 hartree
zpe.thermalcorrenthalpy: 0.227126 hartree
zpe.thermalcorrgfe: 0.174555 hartree
zpe.sumelectzpe: -480.099197 hartree
zpe.sumelectthermal: -480.086984 hartree
zpe.sumelectthermalent: -480.086040 hartree
zpe.sumelectthermalfe: -480.138612 hartree
dipole: 0.4652 0.8887 1.3195
dipole: 1.6575
quadrupole: -54.3620 -66.1266 -61.2640
quadrupole: -2.8872 -1.3228 -1.9931
quadrupole: 6.2222 -5.5424 -0.6798 -2.8872 -1.3228 -1.9931
hfenergy: -480.3131667 hartree
pointgroup: C01 [X(C7H15N1O2)]
dipole: 0.1835356 0.0098003 -0.625662 debye
dipolederiv: -1.2910849 0.4027367 0.2269043 0.4801912 -0.6781225 -0.2855124 0.2683665 -0.2457526 -0.5430989 -0.658765 -0.0118322 -0.1770003 0.1569739 -0.49963 -0.2218906 0.1406026 -0.3196701 -0.8244293 -0.6982291 -0.0699868 0.0471139 -0.0602258 -0.5842041 -0.0105055 -0.0287995 -0.032342 -0.4885999 0.7690555 -0.1686383 -0.0924886 -0.1561015 0.4157955 0.0491822 0.1285176 -0.0763646 0.1989341 0.4908465 0.0043898 0.1273402 0.0447777 0.200844 0.0135025 0.0862429 0.0856069 0.150872 -0.1059716 0.0336923 0.0161976 0.0597825 -0.1185381 -0.0456964 -0.0011477 -0.047456 0.0818953 0.0636208 -0.0401732 0.062936 -0.0191047 0.4107263 0.0977893 0.094829 0.1201979 0.3350909 0.367233 0.0850685 -0.1486419 0.0780526 0.3957176 -0.1045398 -0.2205344 -0.1354638 0.1952841 1.4141031 -0.3588762 0.066668 -0.6430528 0.6727341 0.4934474 -0.362756 0.5995849 1.0612441 -0.4165608 0.0929133 -0.1198544 0.1406861 -0.0065908 0.0255218 -0.0754638 -0.0035392 -0.0282083 0.0094234 0.0327738 0.033648 0.0028746 0.0474873 -0.0323982 -0.0424967 0.0294353 -0.088876 -0.1062279 0.0424403 -0.040001 0.1442022 -0.1745623 0.0137494 0.0084133 -0.0542882 0.0609277 0.0333991 -0.0146648 0.0180159 -0.0014375 0.074728 -0.047 0.0090996 -0.014765 -0.1479157 -0.0847363 0.0797916 -0.0292605 0.0675185 0.1283151 -0.0008712 -0.0324912 0.0105967 0.0812848 0.1110957 -0.011736 -0.02733 0.0076248 0.0680038 0.0392883 -0.0167682 -0.0374791 -0.1421596 0.0333322 -0.1319117 0.0523512 -0.099752 -0.0744283 0.0489816 0.0651075 0.0632777 0.0510391 -0.0076448 -0.0583382 0.1472883 -0.0723321 0.0354282 0.0443371 0.1139682 0.0378386 0.0204773 0.0720891 0.046949 -0.002103 -0.0084914 -0.2823133 -0.1235419 -0.0309339 0.041635 -0.013653 -0.1296715 0.0277079 -0.1639246 0.0504466 0.0642261 -0.0012287 -0.0929444 -0.0019213 0.0242743 -0.1631511 0.0084842 -0.0625338 0.0138096 0.0701402 0.0443694 -0.1426522 0.0280259 0.0434192 -0.0086075 0.0475112 0.0366206 -0.1350833 -0.291458 0.1416454 0.0824515 0.0543188 0.0194494 0.1060759 -0.0186465 -0.0145499 -0.0051457 0.0198111 -0.1071552 0.0586795 -0.0886927 -0.1305622 0.0014661 -0.0272665 0.0591203 -0.0638806 0.1124858 0.0348272 0.0853311 0.0528017 0.0114045 0.1040925 0.0082449 -0.0026258 -0.0206416 0.0691149 -0.0978328 -0.0475827 -0.0817638 -0.0360381 0.0948176 -0.0006331 -0.0138904 0.0383087 -0.0757105 0.0315311 -0.0470387 0.016179 0.1079445 unknown
polarizability: 109.3867797|-2.3555166|81.3587459|0.3661892|6.6241268|81.5793838 unknown
InChI: InChI=1S/C7H15NO2/c1-6(5-8(3)4)10-7(2)9/h6H,5H2,1-4H3
charge 0 multiplicity 1
25 atoms
O  -1.406059 -0.575703 -0.596628
O  -1.826293 0.74655 1.283857
N  2.23053 0.234604 0.060464
C  -0.009755 -0.845085 -0.100137
C  0.903661 0.303846 -0.592751
C  0.389507 -2.213207 -0.645441
C  2.237365 0.838919 1.410942
C  3.328643 0.750992 -0.780875
C  -2.207932 0.249021 0.197119
C  -3.575438 0.4389 -0.425387
H  -0.047993 -0.841804 1.004355
H  0.394047 1.279792 -0.40721
H  1.036076 0.2000 -1.68579
H  1.448608 -2.393582 -0.391357
H  0.276747 -2.243461 -1.744071
H  -0.228404 -3.016134 -0.208266
H  1.419209 0.423407 2.022799
H  2.110026 1.950183 1.388188
H  3.193552 0.610075 1.914949
H  4.295112 0.570532 -0.275906
H  3.254032 1.848145 -0.990721
H  3.344798 0.216355 -1.747047
H  -4.349744 0.098997 0.284135
H  -3.666056 -0.116954 -1.369459
H  -3.749342 1.513812 -0.607459
