program: Gaussian 09
title: 000253124
version: EM64L-G09RevD.01
frameworkgroup: C1[X(C8H14O4S2)]
method: RPBEPBE
basis: SDD
operation: Freq
keyword: #p
keyword: freq=noraman
keyword: PBEPBE/SDD
title: #p freq=noraman PBEPBE/SDD
converged: YES YES NO NO
title: Mulliken charges:
elementType: S S O O O O C C C C C C C C H H H H H H H H H H H H H H
charge: 0.179571 0.179565 -0.421027 -0.421054 -0.223424 -0.223422 -0.325458 -0.325444 -0.674447 -0.674582 -0.727315 -0.727309 0.276056 0.276075 0.210036 0.215807 0.215840 0.209995 0.251049 0.290320 0.251101 0.290391 0.277363 0.288643 0.277377 0.288645 0.382821 0.382828
chargesum: 0.00000
title: Mulliken charges with hydrogens summed into heavy atoms:
elementType: S S O O O O C C C C C C C C
charge: 0.179571 0.179565 -0.038206 -0.038227 -0.223424 -0.223422 0.100386 0.100390 -0.133079 -0.133090 -0.161308 -0.161287 0.276056 0.276075
polarizability: 1.94402429e+02 -1.03369638e-02 1.11443290e+02 9.10815908e+00 -7.57661396e-03 1.12317159e+02
1716.lowfreq: -7.3020 -0.0025 -0.0023 -0.0020 4.1399 8.6520 11.8253 22.9889 27.1570
frequency: 11.8192 22.9805 26.6297 47.5483 55.4967 57.6407 84.7751 90.2458 119.7992 129.0225 135.2676 165.9433 172.6399 211.0926 227.0597 363.8423 368.9642 403.2517 407.2430 507.4724 508.7169 580.0379 580.3893 647.6344 648.2394 687.8938 705.4147 733.5499 733.6951 750.0517 784.7398 828.7570 829.5693 881.4372 888.1176 891.7673 1029.1166 1034.1137 1034.5965 1059.8433 1060.5796 1078.5928 1092.3232 1173.3400 1176.2240 1226.6445 1230.3237 1237.1589 1237.4173 1266.5343 1284.2595 1293.6623 1303.9342 1306.6620 1322.3473 1351.6306 1421.8482 1421.9632 1459.1360 1462.5856 1472.0486 1485.1999 1667.5927 1668.3586 2978.0711 2985.7600 3011.8867 3012.5289 3024.8105 3049.7962 3054.4850 3054.5209 3096.6419 3099.6698 3145.1375 3145.1515 3514.5464 3514.5580
redmass: 8.1226 6.6649 4.3525 7.3220 9.4833 2.4424 4.7789 3.6847 2.1344 4.4673 3.0850 8.8725 6.3856 8.4304 5.6910 3.9353 4.1084 2.2726 2.5623 4.2842 4.3216 2.2920 2.3666 1.8511 1.8060 4.9666 5.6025 6.0125 5.7154 1.0873 1.1540 5.2257 5.2819 1.6350 1.9757 1.4617 3.7151 1.3804 3.2340 1.8414 2.0228 2.8301 1.0390 1.2035 1.2041 1.3312 1.2248 1.1874 1.1889 1.2108 1.2316 1.1392 1.8020 2.0276 1.3537 1.4738 1.1072 1.1073 1.0851 1.0873 1.0733 1.0985 8.5680 8.5992 1.0593 1.0591 1.0590 1.0610 1.0972 1.1034 1.0592 1.0593 1.1076 1.1070 1.1064 1.1064 1.0640 1.0640
irintensity: 0.1819 2.8832 0.5024 2.7074 0.0014 0.0049 1.1717 1.0972 1.1527 0.4272 0.6210 1.0779 0.1494 2.0901 1.9672 12.4612 0.1912 0.0120 1.9469 26.0699 43.4602 57.9327 39.4116 238.3397 2.2027 8.8743 0.7582 14.5143 0.9854 9.8118 1.3701 9.4898 41.4568 0.9364 4.5210 3.0021 6.2201 3.7658 5.7269 279.4683 49.9306 7.2733 0.7742 36.6448 22.5783 2.2327 6.6106 1.4465 2.4258 0.8789 0.1438 4.4569 21.8827 29.0699 47.3400 0.0022 23.1145 25.7913 5.3833 0.9710 0.0723 13.2197 480.3476 135.6073 0.6815 27.0570 5.1922 43.2335 3.6608 29.4507 14.2565 8.0900 1.5059 37.0769 0.7149 0.5020 16.2937 31.6231
temp: 298.150 k
press: 1.00000 atm
elementType: 16 16 8 8 8 8 6 6 6 6 6 6 6 6 1 1 1 1 1 1 1 1 1 1 1 1 1 1
symmnumber: 1
zpe: 567235.4 jmol-1
zpe.correction: 0.216049 hartree
zpe.thermalcorrener: 0.233591 hartree
zpe.thermalcorrenthalpy: 0.234535 hartree
zpe.thermalcorrgfe: 0.165005 hartree
zpe.sumelectzpe: -1409.155250 hartree
zpe.sumelectthermal: -1409.137708 hartree
zpe.sumelectthermalent: -1409.136764 hartree
zpe.sumelectthermalfe: -1409.206294 hartree
dipole: -0.0004 -1.3121 -0.0001
dipole: 1.3121
quadrupole: -125.2998 -94.2971 -100.9065
quadrupole: 0.0072 -20.7652 0.0012
quadrupole: -18.4653 12.5373 5.9280 0.0072 -20.7652 0.0012
hfenergy: -1409.371299 hartree
pointgroup: C01 [X(C8H14O4S2)]
dipole: -0.0000139 -0.0006732 0.5162159 debye
polarizability: 193.3385526|13.0059752|113.3810212|0.0052458|0.0071653|111.4433041 unknown
InChI: InChI=1S/C8H14O4S2/c9-7(10)5-13-3-1-2-4-14-6-8(11)12/h9,11H,1-6H2
charge 0 multiplicity 1
28 atoms
S  3.26706 1.271643 0.603423
S  -3.267042 -1.273129 0.601732
O  4.262172 -1.16017 -1.486414
O  -4.262586 1.164385 -1.481152
O  5.899169 0.45858 -1.822632
O  -5.899689 -0.453413 -1.821405
C  0.557605 0.537918 0.58627
C  -0.557639 -0.539209 0.58371
C  1.95524 -0.104305 0.574208
C  -1.955311 0.103009 0.576999
C  4.838244 0.2239 0.397269
C  -4.838272 -0.224795 0.398888
C  5.091069 -0.105066 -1.055239
C  -5.091385 0.108105 -1.05267
H  0.448044 1.18274 1.480909
H  0.444633 1.192061 -0.300461
H  -0.445675 -1.188123 -0.306969
H  -0.447046 -1.189286 1.474424
H  2.111813 -0.739293 1.464512
H  2.122648 -0.702352 -0.336421
H  -2.11045 0.733715 1.47059
H  -2.124234 0.705347 -0.330522
H  4.725108 -0.68946 1.00174
H  5.66345 0.839926 0.781327
H  -4.724952 0.686911 1.005817
H  -5.663411 -0.841823 0.781474
H  4.428116 -1.326628 -2.454068
H  -4.42868 1.333409 -2.448335
