program: Gaussian 09
title: 000253087
version: EM64L-G09RevD.01
frameworkgroup: C1[X(C18H18O5)]
method: RPBEPBE
basis: SDD
operation: Freq
keyword: #pfreq=noraman
keyword: PBEPBE/SDD
title: #p freq=noraman PBEPBE/SDD
converged: YES YES NO NO
title: Mulliken charges:
elementType: O O O O O C C C C C C C C C C C C C C C C C C H H H H H H H H H H H H H H H H H H
charge: -0.333927 -0.307374 -0.392857 -0.373877 -0.256305 0.073579 0.123033 0.185128 0.108642 0.169941 -0.316542 -0.364734 0.492098 -0.333799 -0.285084 -0.359459 -0.393205 0.323740 -0.363990 -0.371035 -0.527022 -0.524757 -0.536370 0.254520 0.258676 0.292334 0.274531 0.239335 0.238179 0.253805 0.244958 0.383892 0.268277 0.229737 0.225240 0.247230 0.222374 0.228480 0.226116 0.226551 0.249941
chargesum: 0.00000
title: Mulliken charges with hydrogens summed into heavy atoms:
elementType: O O O O O C C C C C C C C C C C C C C C C C C
charge: -0.333927 -0.307374 -0.008966 -0.373877 -0.256305 0.073579 0.123033 0.185128 0.108642 0.169941 -0.062021 -0.106058 0.492098 -0.041464 -0.010553 -0.120124 -0.155026 0.323740 -0.110185 -0.126078 0.196232 0.173327 0.166237
polarizability: 4.98980390e+02 -2.31802378e+01 2.36235645e+02 7.81866788e+00 3.39054546e+00 1.05300360e+02
1716.lowfreq: -8.3433 -3.4121 -0.0007 0.0004 0.0006 2.9357 23.1881 26.5413 35.8988
frequency: 23.1138 26.4574 35.8530 53.3922 67.9094 81.8211 90.3867 113.2317 134.3562 139.3470 151.2135 166.0111 168.6570 176.0086 193.2886 195.0748 240.0246 244.0226 255.8524 307.5933 316.4800 358.3172 374.0064 386.3078 399.7598 416.8914 420.8791 449.4515 456.8441 470.8423 513.4012 532.1462 535.0593 552.1551 598.3470 632.3844 633.5845 694.9364 704.7186 724.8454 740.5307 772.3161 779.1227 813.8030 829.1454 838.0113 839.4444 884.0772 907.2313 910.1022 950.2031 957.4277 971.5218 974.5806 982.5151 998.6355 1005.6116 1015.5996 1025.6269 1072.2124 1110.8756 1111.9240 1112.1970 1113.9421 1138.7764 1152.5641 1156.9130 1157.7218 1178.3345 1216.0769 1217.5362 1228.3731 1242.0180 1257.7844 1287.7075 1295.1299 1314.2984 1339.6923 1361.1757 1376.4532 1393.5331 1421.7232 1432.8483 1434.9724 1437.2078 1454.2213 1458.5403 1460.6178 1468.4767 1471.9033 1476.9317 1484.3072 1502.4085 1517.2510 1565.3831 1586.6294 1612.0557 1616.3488 1624.6275 2440.9141 2967.1833 2970.2630 2979.5552 3058.4466 3067.4806 3083.8408 3102.3120 3118.4096 3122.2878 3129.6071 3132.3765 3143.7963 3156.1276 3166.1468 3170.9898 3183.5519 3185.1345
redmass: 4.7647 3.4729 5.3922 4.6048 3.4103 3.7912 3.0210 3.7923 4.7950 2.0396 2.0207 2.3949 1.6151 2.7706 2.6994 2.1207 4.5619 1.5098 3.7051 6.8450 6.3130 4.8566 4.1038 5.9099 6.1406 6.1106 2.9381 6.3219 5.9267 5.1648 2.6935 4.5696 4.9634 4.9624 4.8910 5.6563 4.7594 4.2847 6.5525 6.5326 3.9633 6.4605 6.5939 1.3019 1.6267 1.9020 3.5399 6.4678 5.6692 1.9087 1.3917 1.3765 1.3609 6.8258 8.7204 2.7911 4.9291 1.1740 1.0649 2.7126 1.2506 1.2595 1.2543 1.3479 1.4710 1.3688 1.4159 1.4659 1.2641 1.6924 1.7705 3.4755 2.7492 2.7578 2.2478 2.2537 1.3292 3.4230 5.9639 4.9901 3.5162 1.2856 1.3378 2.3754 1.4005 1.5114 1.1800 1.2751 1.0496 1.0831 1.0590 1.0559 2.5397 3.6924 6.5850 3.1770 5.4329 4.7548 5.8678 1.0760 1.0326 1.0308 1.0299 1.1043 1.1038 1.1045 1.0894 1.1026 1.1040 1.0901 1.0993 1.0882 1.0890 1.0941 1.0966 1.0968 1.0910
irintensity: 0.2179 1.5756 0.3758 0.0967 2.4168 0.6233 5.0210 7.8448 0.4230 2.1708 1.3177 0.3836 0.0782 0.3526 8.0377 1.9379 5.0357 0.7741 6.0672 5.7718 6.6804 0.2662 3.1538 5.2678 0.4005 20.2165 0.2928 9.6830 7.2802 10.7126 23.0258 3.5355 0.5102 59.0723 27.4035 5.0117 3.4612 7.0439 15.8946 12.1099 1.4115 25.0694 4.7256 11.2853 40.6560 68.3485 9.1431 7.6130 23.6281 0.5941 2.7851 3.9832 1.2305 106.2291 71.5305 8.7661 83.1266 31.4270 137.3052 29.9616 13.0784 0.1943 3.3756 9.1800 7.1305 0.4576 3.8797 21.1681 343.9515 106.8949 91.4074 325.4869 368.3938 45.5354 38.1498 28.4534 26.5982 14.9622 37.4283 53.4069 177.1329 86.5841 62.0326 104.3457 0.7368 270.2183 143.3859 125.4765 14.6404 50.0756 11.6852 25.8829 212.0475 178.3652 102.2077 148.5723 393.9450 376.6247 37.6016 463.5669 102.4592 75.1179 49.3913 42.7417 27.2750 19.4740 1.3897 29.1932 14.9389 16.0195 16.6861 6.4005 3.5430 20.0468 7.2202 11.2055 30.4083
temp: 298.150 k
press: 1.00000 atm
elementType: 8 8 8 8 8 6 6 6 6 6 6 6 6 6 6 6 6 6 6 6 6 6 6 1 1 1 1 1 1 1 1 1 1 1 1 1 1 1 1 1 1
symmnumber: 1
zpe: 833023.1 jmol-1
zpe.correction: 0.317282 hartree
zpe.thermalcorrener: 0.339608 hartree
zpe.thermalcorrenthalpy: 0.340552 hartree
zpe.thermalcorrgfe: 0.264160 hartree
zpe.sumelectzpe: -1071.114198 hartree
zpe.sumelectthermal: -1071.091872 hartree
zpe.sumelectthermalent: -1071.090927 hartree
zpe.sumelectthermalfe: -1071.167320 hartree
dipole: 5.2391 -3.6043 0.2473
dipole: 6.3640
quadrupole: -98.5536 -137.5178 -135.6404
quadrupole: 18.3014 4.8541 2.1523
quadrupole: 25.3504 -13.6139 -11.7365 18.3014 4.8541 2.1523
hfenergy: -1071.4314796 hartree
pointgroup: C01 [X(C18H18O5)]
dipole: 1.8971103 1.5602904 -0.4851383 debye
polarizability: 490.011884|54.4102228|233.898442|2.6787558|-37.0430706|116.6060693 unknown
InChI: InChI=1S/C18H18O5/c1-21-13-7-4-12(5-8-13)6-9-14(19)17-15(20)10-11-16(22-2)18(17)23-3/h4-11,20H,1-3H3
charge 0 multiplicity 1
41 atoms
O  -1.908376 1.101049 -0.74882
O  -4.677224 1.673263 -0.951364
O  -3.115979 -3.317971 1.096186
O  -0.752085 -2.743115 0.860519
O  6.214786 2.046232 0.047489
C  -2.405812 -1.118908 0.234984
C  -2.849177 0.134832 -0.314796
C  -4.227158 0.441088 -0.41172
C  -3.434876 -2.079533 0.606303
C  -0.992589 -1.516766 0.459004
C  -5.199447 -0.515378 -0.029111
C  -4.812304 -1.765703 0.466174
C  2.646327 -0.232569 0.363702
C  0.135577 -0.593033 0.29486
C  1.428293 -1.030249 0.473603
C  2.645602 1.170632 0.079674
C  3.907439 -0.867922 0.54789
C  5.087635 1.2304 0.167557
C  3.840891 1.890905 -0.017284
C  5.120705 -0.158613 0.452985
C  -1.92359 1.360339 -2.211688
C  -4.393415 2.853022 -0.101648
C  7.533109 1.427743 0.231094
H  -6.255471 -0.249128 -0.139371
H  -5.542753 -2.524451 0.757892
H  -0.107611 0.436698 0.029635
H  1.554405 -2.093836 0.723795
H  1.695081 1.696019 -0.059729
H  3.931544 -1.941763 0.769568
H  3.848323 2.963752 -0.231877
H  6.06835 -0.684377 0.600419
H  -2.056745 -3.365429 1.086928
H  -2.925761 1.694231 -2.530657
H  -1.627681 0.445478 -2.757578
H  -1.179538 2.155073 -2.374987
H  -3.306412 2.967649 0.060285
H  -4.91147 2.756696 0.871561
H  -4.793504 3.716742 -0.654717
H  7.713681 0.640192 -0.525309
H  7.636537 1.001974 1.247427
H  8.253693 2.246834 0.095324
