program: Gaussian 09
title: 000253068
version: EM64L-G09RevD.01
frameworkgroup: C1[X(C12H21N)]
method: RPBEPBE
basis: SDD
operation: Freq
keyword: #pfreq=noraman
keyword: PBEPBE/SDD
title: #p freq=noraman PBEPBE/SDD
converged: YES YES NO NO
title: Mulliken charges:
elementType: N C C C C C C C C C C C C H H H H H H H H H H H H H H H H H H H H H
charge: -0.100195 0.364306 -0.304523 -0.374225 -0.558692 -0.054707 0.502115 -0.770861 -0.787305 -0.472620 -0.851295 -0.642393 -0.637079 0.257489 0.239303 0.252092 0.220317 0.225334 0.226769 0.210043 0.214598 0.211058 0.207296 0.243486 0.225749 0.226992 0.225090 0.224267 0.242991 0.195591 0.206706 0.220484 0.189287 0.222531
chargesum: 0.00000
title: Mulliken charges with hydrogens summed into heavy atoms:
elementType: N C C C C C C C C C C C C
charge: -0.100195 0.364306 -0.047033 -0.134923 -0.086282 0.170627 0.502115 -0.119451 -0.125465 -0.246871 -0.174946 0.002895 -0.004777
polarizability: 1.50096671e+02 1.93200252e+00 1.25798256e+02 -3.52327853e+00 -8.71635319e-01 1.16415791e+02
1716.lowfreq: -16.4715 -11.0622 -0.0007 -0.0006 -0.0003 9.4240 63.3906 115.1709 130.6599
frequency: 63.2561 115.1277 130.6292 153.9669 180.3001 184.5115 196.1011 213.2767 231.9191 248.3700 263.4638 290.9750 299.4796 325.5402 370.4982 385.5015 400.8912 452.5842 457.1875 492.5228 509.0480 563.7631 609.6464 717.2138 764.5377 802.2385 819.2736 850.5110 859.4897 898.5317 927.1037 936.7582 940.6536 966.6273 997.3382 1005.9054 1023.5116 1033.7786 1038.8231 1047.7335 1077.0587 1082.8031 1091.8431 1108.3858 1136.6863 1140.0092 1164.4542 1187.6564 1202.7217 1222.5385 1225.0051 1244.4160 1252.5379 1259.3548 1285.5953 1308.0976 1333.2998 1363.8276 1375.7814 1390.1439 1391.7826 1418.1691 1439.6006 1457.6949 1458.4998 1459.2933 1466.8557 1469.4649 1469.9899 1474.9426 1484.8770 1491.1175 1494.6931 1497.0505 1658.9680 2857.4342 2871.7072 2926.4484 2954.9352 2967.0156 2971.6752 3003.7150 3022.6568 3025.6151 3028.1087 3035.5068 3048.4954 3049.2415 3056.5098 3063.3170 3074.2928 3079.2417 3082.5329 3086.3799 3107.1051 3110.5394
redmass: 2.6060 2.7947 2.5639 2.8411 1.0349 1.0954 2.3310 1.4271 1.1086 1.3939 1.9576 1.7135 2.6135 3.0858 2.3277 2.4116 2.6292 2.9035 2.5965 3.6391 2.9145 3.1245 3.5298 2.3743 2.4309 2.3108 2.4296 2.8363 2.0248 2.8191 2.5512 1.6823 1.6929 1.8193 1.4081 1.5746 2.1467 1.6298 1.5309 1.7496 1.7580 1.3479 1.2710 1.6123 1.5275 1.4377 1.8097 1.9002 2.8167 2.2698 1.8511 1.5174 2.5057 2.5957 1.5025 1.7945 2.1253 1.3362 1.2209 1.2431 1.2046 1.1371 1.1484 1.0480 1.0575 1.0644 1.0634 1.0643 1.0555 1.0620 1.0531 1.0663 1.0511 1.0576 6.6102 1.0556 1.0560 1.0817 1.0372 1.0370 1.0371 1.0725 1.0745 1.0964 1.0771 1.0810 1.0893 1.0895 1.0978 1.1005 1.0983 1.0980 1.0986 1.0970 1.0919 1.1061
irintensity: 0.3927 1.3073 0.4127 1.9428 0.0263 0.1447 0.0850 0.2332 0.6236 0.1045 0.6090 3.4053 6.4388 0.4234 2.2478 3.4563 1.0574 0.3073 1.9022 0.9579 3.4420 1.8293 0.7707 3.2201 7.1525 7.7768 4.6580 1.7332 10.3749 0.8149 2.5719 2.5111 8.3577 2.5319 0.2171 28.6012 41.1124 6.5808 6.1299 7.1264 3.3307 15.9641 9.0002 4.9107 6.7539 2.1885 5.8959 4.3592 6.1099 1.4174 4.0366 8.3028 15.8303 1.5184 4.9924 19.6462 11.0273 11.6115 17.9173 15.8594 13.1325 5.1865 9.5029 14.2463 6.7461 7.9959 10.5129 5.8377 12.3530 6.6143 9.1459 9.1669 25.2116 11.1966 12.7919 84.1098 133.1701 31.9498 41.4426 23.0930 61.5487 57.8502 47.5566 21.8333 27.8246 52.6637 19.6553 16.7793 67.5634 36.3660 26.6967 41.4056 57.1694 25.1670 34.1855 19.8553
temp: 298.150 k
press: 1.00000 atm
elementType: 7 6 6 6 6 6 6 6 6 6 6 6 6 1 1 1 1 1 1 1 1 1 1 1 1 1 1 1 1 1 1 1 1 1
symmnumber: 1
zpe: 794178.5 jmol-1
zpe.correction: 0.302487 hartree
zpe.thermalcorrener: 0.316741 hartree
zpe.thermalcorrenthalpy: 0.317686 hartree
zpe.thermalcorrgfe: 0.263440 hartree
zpe.sumelectzpe: -523.519433 hartree
zpe.sumelectthermal: -523.505178 hartree
zpe.sumelectthermalent: -523.504234 hartree
zpe.sumelectthermalfe: -523.558479 hartree
dipole: 0.4401 0.7632 -0.0846
dipole: 0.8851
quadrupole: -79.0745 -82.3630 -81.1858
quadrupole: -1.4268 -0.7658 0.4876
quadrupole: 1.7999 -1.4886 -0.3114 -1.4268 -0.7658 0.4876
hfenergy: -523.8219193 hartree
pointgroup: C01[X(C12H21N1)]
dipole: 0.1757372 0.2981715 0.0381867 debye
polarizability: 149.8640216|2.7334776|125.5971734|-4.1048603|1.471478|116.8495235 unknown
InChI: InChI=1S/C12H21N/c1-8-6-11(13(4)5)10-7-9(8)12(10,2)3/h6,9-11H,7H2,1-5H3
charge 0 multiplicity 1
34 atoms
N  -2.352475 -0.748312 0.101873
C  1.575856 -0.910329 0.076285
C  0.098996 -1.095033 -0.502248
C  1.476898 0.557951 -0.545886
C  0.492025 -0.047896 -1.611791
C  -0.933068 -0.50405 0.5004
C  0.629379 1.465858 0.349599
C  2.603553 -1.795873 -0.667136
C  1.815757 -1.062104 1.588845
C  -0.552947 0.956898 0.802409
C  1.133316 2.857384 0.657951
C  -2.786211 -0.16845 -1.182917
C  -3.309939 -0.479518 1.192388
H  -0.205347 -2.108915 -0.813711
H  2.411364 1.036592 -0.886963
H  -0.28569 0.636419 -1.980724
H  1.005103 -0.518467 -2.465781
H  -0.823584 -1.080113 1.446564
H  2.496045 -1.760225 -1.76457
H  3.635153 -1.479448 -0.419612
H  2.493904 -2.852044 -0.3542
H  1.596855 -2.098477 1.912121
H  2.876461 -0.857354 1.831552
H  1.196274 -0.374474 2.187835
H  -1.22244 1.554203 1.435893
H  0.423991 3.421023 1.289349
H  1.303849 3.436649 -0.271684
H  2.107639 2.81892 1.185489
H  -2.184078 -0.581071 -2.009335
H  -2.719315 0.947335 -1.224235
H  -3.839516 -0.453062 -1.36185
H  -4.302012 -0.884976 0.919187
H  -3.446272 0.604765 1.433602
H  -2.974526 -0.991304 2.113303
