program: Gaussian 09
title: 000253062
version: EM64L-G09RevD.01
frameworkgroup: C1[X(C10H18O5)]
method: RPBEPBE
basis: SDD
operation: Freq
keyword: #pfreq=noraman
keyword: PBEPBE/SDD
title: #p freq=noraman PBEPBE/SDD
converged: YES YES NO NO
title: Mulliken charges:
elementType: O O O O O C C C C C C C C C C H H H H H H H H H H H H H H H H H H
charge: -0.272517 -0.416928 -0.416929 -0.231511 -0.231512 -0.382387 -0.382387 -0.366022 -0.366023 -0.256055 -0.256056 -0.482498 -0.482498 0.174367 0.174368 0.208189 0.208435 0.208435 0.208189 0.213264 0.215524 0.213264 0.215525 0.183880 0.184063 0.183881 0.184063 0.253716 0.254155 0.253716 0.254155 0.376067 0.376067
chargesum: 0.00000
title: Mulliken charges with hydrogens summed into heavy atoms:
elementType: O O O O O C C C C C C C C C C
charge: -0.272517 -0.040861 -0.040862 -0.231511 -0.231512 0.034237 0.034237 0.062766 0.062766 0.111887 0.111888 0.025373 0.025373 0.174367 0.174368
polarizability: 1.73349071e+02 6.31079975e-06 1.16739692e+02 3.17272754e-01 1.03836983e-05 8.74197187e+01
1716.lowfreq: -0.0001 0.0011 0.0012 4.3496 5.5791 12.5367 15.7309 18.9646 29.8152
frequency: 15.6744 17.6127 29.8151 34.5844 46.3467 63.8424 78.2827 79.9032 109.6415 116.2299 128.9944 137.5456 148.6977 172.0430 219.5531 303.6409 313.6495 426.2471 441.3894 490.8539 501.7124 502.5831 511.7463 589.2835 594.3503 637.7092 637.8593 737.3099 737.7624 797.3991 804.0504 857.2092 860.1694 911.1306 914.3464 920.4154 1015.2827 1023.4866 1029.7493 1064.2066 1069.6581 1076.6265 1077.2743 1098.0561 1102.5815 1109.0607 1117.9979 1151.3823 1171.7030 1230.0929 1234.5054 1236.2375 1240.2524 1264.6749 1271.2350 1276.1167 1279.7614 1287.5651 1288.1821 1323.4398 1335.0238 1363.4905 1377.3992 1377.4906 1412.9415 1438.8142 1438.9144 1467.4000 1469.8855 1473.6226 1480.2929 1486.8193 1495.4625 1669.1443 1669.3684 2903.3570 2914.1003 2953.4926 2954.9394 2985.2937 2985.7684 2989.2097 2989.3050 2998.0990 2998.3151 3027.0414 3027.1861 3043.0317 3043.2496 3066.7531 3067.1842 3511.2291 3511.2386
redmass: 11.0940 6.4149 6.6841 2.5368 3.8466 1.6973 5.3015 3.7962 1.8577 2.4295 7.7083 1.9721 3.1318 5.8695 5.7875 5.4471 4.7782 4.3654 4.2295 3.3147 1.8033 1.8249 3.9078 4.6341 4.5829 1.3229 1.3226 1.1310 1.1351 1.2370 1.2553 4.8435 4.6440 1.3316 7.0721 1.3104 4.1271 3.2658 3.7915 2.6288 3.9150 3.1338 2.4844 2.6262 1.6592 1.6176 3.1253 1.1847 1.3208 1.3285 1.3874 1.2713 1.2664 1.4951 1.5238 1.1018 1.0921 1.0946 1.1043 1.4234 1.6220 1.4961 1.8491 1.8509 1.4971 1.0849 1.0850 1.0744 1.0744 1.0886 1.0909 1.0942 1.0836 8.2256 8.2351 1.0548 1.0546 1.1048 1.1064 1.0601 1.0603 1.0611 1.0611 1.0591 1.0591 1.0990 1.0989 1.1018 1.1017 1.1038 1.1037 1.0639 1.0639
irintensity: 0.0048 0.0065 0.0005 2.6008 0.0000 0.0000 3.2488 3.0873 2.9252 0.0005 0.0051 0.0000 5.0968 0.1698 1.1306 7.7351 3.2843 0.1830 5.1632 0.7923 59.4039 0.3572 98.1609 0.1749 10.2231 0.5880 256.0700 0.0108 33.3917 0.0168 2.3831 0.2324 1.0342 0.4287 25.1065 2.6697 173.0444 90.4576 186.3184 0.0391 252.8289 6.4735 44.6215 31.3950 0.0204 4.2822 10.2370 0.0033 4.0708 21.7281 0.1018 0.0000 1.1257 35.7803 0.7040 0.0000 0.6885 0.0044 0.5331 106.1794 5.4545 1.9309 2.5405 67.0067 0.3823 8.5334 46.6952 0.7824 0.0152 7.5884 21.0504 0.5590 9.6365 1.3895 416.9596 25.0070 103.6899 99.9873 0.0009 0.8803 9.1663 9.7582 4.5361 0.9407 98.3948 0.0236 2.2656 0.0465 5.2596 0.0092 157.5503 34.5804 4.0163
temp: 298.150 k
press: 1.00000 atm
elementType: 8 8 8 8 8 6 6 6 6 6 6 6 6 6 6 1 1 1 1 1 1 1 1 1 1 1 1 1 1 1 1 1 1
symmnumber: 1
zpe: 716883.6 jmol-1
zpe.correction: 0.273047 hartree
zpe.thermalcorrener: 0.291277 hartree
zpe.thermalcorrenthalpy: 0.292221 hartree
zpe.thermalcorrgfe: 0.221263 hartree
zpe.sumelectzpe: -766.775799 hartree
zpe.sumelectthermal: -766.757569 hartree
zpe.sumelectthermalent: -766.756625 hartree
zpe.sumelectthermalfe: -766.827583 hartree
dipole: 0.0000 1.4842 0.0000
dipole: 1.4842
quadrupole: -83.2688 -101.4232 -87.8467
quadrupole: 0.0000 0.7086 0.0000
quadrupole: 7.5774 -10.5769 2.9995 0.0000 0.7086 0.0000
hfenergy: -767.0488459 hartree
pointgroup: C01 [X(C10H18O5)]
dipole: 0. -0.5839335 0.0000016 debye
polarizability: 173.3491997|0.0000338|116.7396917|-0.2993817|-0.0000873|87.4195903 unknown
InChI: InChI=1S/C10H18O5/c11-9(12)5-1-3-7-15-8-4-2-6-10(13)14/h11,13H,1-8H2
charge 0 multiplicity 1
33 atoms
O  -0.000003 -0.32732 -0.000004
O  -7.357835 -0.908415 0.045059
O  7.35783 -0.908408 -0.045069
O  -6.509689 1.249597 -0.065031
O  6.509681 1.249604 0.065009
C  -2.417362 -0.469528 0.002923
C  2.417356 -0.469525 -0.002933
C  -3.765778 0.283402 0.004656
C  3.765772 0.283406 -0.004668
C  -1.220969 0.487025 0.001883
C  1.220963 0.487027 -0.001897
C  -4.960329 -0.688449 0.00739
C  4.960324 -0.688444 -0.0074
C  -6.301459 0.01814 -0.009029
C  6.301452 0.018146 0.009014
H  -2.343688 -1.125237 -0.886505
H  -2.341326 -1.1263 0.891339
H  2.341321 -1.126301 -0.891346
H  2.343683 -1.125231 0.886498
H  -3.831683 0.946332 0.88887
H  -3.835763 0.945391 -0.87968
H  3.831676 0.946333 -0.888884
H  3.835756 0.945397 0.879665
H  -1.240184 1.143115 0.902383
H  -1.242502 1.143911 -0.897967
H  1.240176 1.143111 -0.902401
H  1.242497 1.143917 0.897949
H  -4.92479 -1.364226 -0.870083
H  -4.935597 -1.352504 0.893288
H  4.924786 -1.364218 0.870075
H  4.935591 -1.352503 -0.893295
H  -8.223229 -0.415726 0.027311
H  8.223224 -0.415718 -0.027324
