program: Gaussian 09
title: 000023743
version: EM64L-G09RevD.01
frameworkgroup: C1[X(C5H10O2)]
method: RPBEPBE
basis: SDD
operation: Freq
keyword: #pfreq=noraman
keyword: PBEPBE/SDD
title: #p freq=noraman PBEPBE/SDD
converged: YES YES NO NO
title: Mulliken charges:
elementType: O O C C C C C H H H H H H H H H H
charge: -0.274328 -0.447546 0.282202 -0.473517 -0.466683 -0.293128 -0.709790 0.212848 0.247603 0.248340 0.228801 0.217888 0.205340 0.225960 0.225441 0.225606 0.344962
chargesum: 0.00000
title: Mulliken charges with hydrogens summed into heavy atoms:
elementType: O O C C C C C
charge: -0.274328 -0.102584 0.282202 -0.013066 0.010458 0.130101 -0.032783
polarizability: 6.57973745e+01 6.98816751e-01 5.52788308e+01 -2.39891489e-01 8.83719289e-01 5.47111298e+01
1716.lowfreq: 0.0007 0.0009 0.0010 13.0810 17.5821 21.6173 99.9190 176.9228 214.1727
frequency: 99.7760 176.8684 214.1671 280.2838 326.7700 359.3611 423.8349 480.7010 585.6065 643.5839 747.9904 780.3319 846.5784 886.2189 896.8407 914.1368 977.2425 1016.6830 1038.0435 1087.3773 1120.4744 1151.3966 1167.8466 1205.9076 1224.4014 1284.2343 1319.2141 1331.9310 1359.9376 1390.3379 1450.5484 1460.9266 1468.2783 1470.6401 1492.2241 2995.0932 2998.4854 3024.1005 3032.6887 3059.6595 3091.3875 3096.2269 3106.1555 3113.2117 3554.9552
redmass: 2.5778 2.1385 1.0524 1.8993 1.4474 2.6071 2.4359 3.6742 2.7809 3.0864 4.9290 3.2616 1.7198 2.2858 1.5770 2.9787 2.5476 1.3700 2.2950 1.7651 1.4541 1.4910 1.6761 1.7644 1.3732 1.3831 1.2510 1.4151 1.9179 1.2801 1.1021 1.0626 1.0723 1.0787 1.0915 1.0362 1.0587 1.0616 1.0634 1.1066 1.0987 1.1036 1.1014 1.1035 1.0652
irintensity: 4.9137 1.9442 0.2718 26.4931 69.4314 47.5511 5.2600 39.6870 0.9942 6.0181 7.9889 50.8367 15.2212 67.0349 6.0944 11.5205 52.3824 31.6266 13.5033 47.9431 38.1718 35.8062 28.8439 17.5365 27.7150 11.3711 3.6812 8.9272 27.8665 30.6632 7.8929 10.3146 17.9382 2.3606 1.5578 17.2303 68.7666 30.5356 28.8201 26.6300 25.7765 17.4779 6.8751 50.4794 5.0685
temp: 298.150 k
press: 1.00000 atm
elementType: 8 8 6 6 6 6 6 1 1 1 1 1 1 1 1 1 1
symmnumber: 1
zpe: 381325.6 jmol-1
zpe.correction: 0.145239 hartree
zpe.thermalcorrener: 0.152670 hartree
zpe.thermalcorrenthalpy: 0.153614 hartree
zpe.thermalcorrgfe: 0.114186 hartree
zpe.sumelectzpe: -346.390890 hartree
zpe.sumelectthermal: -346.383459 hartree
zpe.sumelectthermalent: -346.382515 hartree
zpe.sumelectthermalfe: -346.421943 hartree
dipole: 0.4804 -0.2085 -0.8019
dipole: 0.9578
quadrupole: -38.1939 -46.6023 -41.4767
quadrupole: -0.9395 -0.7763 2.9299
quadrupole: 3.8971 -4.5114 0.6143 -0.9395 -0.7763 2.9299
hfenergy: -346.5361292 hartree
pointgroup: C01 [X(C5H10O2)]
dipole: 0.204707 -0.087247 -0.3040857 debye
dipolederiv: -0.9857469 -0.1759205 0.0531229 -0.2697064 -0.6333099 0.0761864 -0.0141189 -0.0679343 -0.4391849 -0.6645725 -0.1680739 0.0208419 -0.2427213 -0.326211 0.1537316 0.1344924 0.2224829 -0.8836912 0.9556312 0.1377848 -0.0724734 0.4115822 0.6696726 -0.1678809 -0.1372138 -0.1266191 0.8845012 -0.1247695 0.0950561 0.0231529 0.0391185 -0.0656169 -0.0958272 -0.0038047 -0.0117043 0.0738698 -0.0362211 -0.0259482 -0.0932257 0.0016053 -0.0697348 -0.0367464 -0.0113898 -0.0635277 0.0978451 0.6553826 0.1284149 -0.0223039 -0.0534799 0.2129438 0.0183215 -0.0525162 0.0014909 0.3345 -0.1708586 0.026318 -0.1130266 0.0488143 0.0133564 0.0657553 -0.056074 0.0236209 -0.0686029 0.0445914 0.0042513 -0.00733 -0.0072141 0.0858885 0.0559472 -0.0219436 0.0035806 -0.1592004 0.0746771 -0.0800112 -0.0096702 -0.0720852 -0.0940789 0.0052081 -0.0050368 0.032028 0.0917931 0.0906486 -0.0158814 -0.006202 0.0147953 0.0171883 0.0613373 -0.0525329 0.0862386 -0.0882469 -0.1019814 0.0821479 0.0852052 0.0677089 0.0573714 -0.0281565 0.1128013 -0.044507 0.0357071 -0.055986 -0.0440129 -0.0696013 -0.0380871 0.0263393 -0.0635504 -0.1305028 -0.1032322 -0.0969901 -0.072457 -0.0632287 0.0695462 -0.0450993 -0.0036992 0.0705691 0.1283678 0.1171296 -0.0703246 0.0746758 -0.0176812 0.0611575 -0.0080856 0.0886099 0.0598185 0.021945 0.0648369 -0.1235809 -0.0089855 -0.0850103 -0.0226835 -0.1300935 -0.0513722 -0.0147299 -0.0195349 0.0052124 0.0956227 0.01895 0.0806013 0.0263521 0.1225463 -0.0245588 -0.0709085 0.0645955 -0.097555 0.0334082 0.3070217 0.1211941 0.0771379 0.1604016 0.0972113 -0.0890753 0.0424662 -0.0415412 0.2825748 unknown
polarizability: 65.810571|0.4486121|55.2656337|0.3945284|0.9115728|54.7111303 unknown
InChI: InChI=1S/C5H10O2/c1-5(6)3-2-4-7-5/h6H,2-4H2,1H3
charge 0 multiplicity 1
17 atoms
O  0.100921 1.187329 0.017675
O  -1.010815 -0.554472 1.261918
C  -0.691717 -0.049435 -0.086653
C  0.266572 -1.0895 -0.693795
C  1.619218 -0.720281 -0.032299
C  1.547209 0.823862 0.087052
C  -1.963216 0.288759 -0.865747
H  0.305025 -0.956735 -1.789789
H  -0.060614 -2.1149 -0.462511
H  1.672766 -1.181797 0.967385
H  2.487978 -1.052307 -0.625372
H  1.960983 1.201283 1.038534
H  2.046371 1.336389 -0.756528
H  -1.718553 0.609837 -1.892138
H  -2.624992 -0.592948 -0.907855
H  -2.506665 1.114364 -0.371355
H  -1.447372 0.181654 1.763378
