program: Gaussian 09
title: 000023752
version: EM64L-G09RevD.01
frameworkgroup: C1[X(C8H16N2O2)]
method: RPBEPBE
basis: SDD
operation: Freq
keyword: #p
keyword: freq=noraman
keyword: PBEPBE/SDD
title: #p freq=noraman PBEPBE/SDD
converged: NO YES NO NO
title: Mulliken charges:
elementType: O O N N C C C C C C C C H H H H H H H H H H H H H H H H
charge: -0.304864 -0.304739 -0.133789 -0.133850 -0.524626 -0.524615 0.263860 0.263754 -0.634514 -0.618062 -0.617903 -0.634552 0.252355 0.251734 0.251542 0.252526 0.228338 0.228459 0.269701 0.282171 0.219601 0.219620 0.219634 0.282076 0.219574 0.269747 0.228439 0.228382
chargesum: 0.00000
title: Mulliken charges with hydrogens summed into heavy atoms:
elementType: O O N N C C C C C C C C
charge: -0.304864 -0.304739 -0.133789 -0.133850 -0.020538 -0.020547 0.263860 0.263754 0.091985 0.103330 0.103381 0.092016
polarizability: 1.43030919e+02 1.25280855e+01 1.08262364e+02 2.76723961e-02 3.42088065e-03 7.33754638e+01
1716.lowfreq: -12.2950 -9.3402 -3.5745 -0.0008 -0.0008 -0.0006 11.2766 25.9773 32.4233
frequency: -11.2406 25.6412 30.8109 65.8108 80.5335 92.5995 117.9284 127.3491 146.0514 172.6717 207.1724 229.2931 247.3669 252.1533 341.3143 376.5955 391.0884 439.4656 527.7298 544.6347 547.0195 575.8417 598.0454 737.3969 817.7779 832.9196 949.0036 963.5511 1007.7963 1051.8410 1052.5959 1078.1644 1093.6441 1093.6916 1133.1550 1134.9452 1145.4042 1153.1291 1153.6037 1236.9376 1243.0343 1255.2318 1291.1709 1333.5320 1390.0327 1397.2346 1409.2463 1409.4312 1440.1164 1441.7607 1454.5720 1458.0141 1473.6842 1474.7046 1476.6901 1476.7967 1488.9284 1489.0709 1506.4886 1506.8266 1576.5933 1586.3194 2960.1495 2960.3813 2967.3629 2968.0456 3000.4886 3007.8900 3024.7051 3024.9948 3039.5600 3039.6958 3045.5795 3068.4481 3119.1473 3119.2736 3132.0318 3132.4660
redmass: 2.4130 2.0249 1.2451 1.7462 4.0445 3.4253 1.3473 1.0683 1.8400 1.8031 4.1678 5.3980 2.4498 2.4578 3.8569 3.6766 2.4831 3.1393 4.0306 2.2112 3.3047 5.1660 4.4878 5.9704 1.6235 4.3309 3.3525 2.7493 2.1888 1.3705 1.3690 2.9703 1.2232 1.2232 1.8145 1.2548 1.3795 1.2677 2.0312 3.5171 6.5986 1.9437 1.1145 1.8446 2.7256 2.4538 1.1817 1.1995 1.1547 1.1625 1.1190 1.1109 1.0424 1.0426 1.0992 1.0961 1.0453 1.0453 1.2395 1.2203 6.2626 5.8614 1.0384 1.0383 1.0366 1.0367 1.0618 1.0604 1.1009 1.1009 1.1016 1.1016 1.0980 1.1010 1.0968 1.0968 1.0942 1.0942
irintensity: 10.6033 2.1997 0.0336 0.5965 10.5357 0.0042 0.9941 0.0069 2.8379 0.0003 0.0000 0.0007 0.0003 17.8115 32.3731 0.0006 3.6676 0.0001 6.0348 2.6513 0.0023 33.5894 0.0003 1.9604 15.1961 0.0077 0.0002 39.7705 0.0020 0.0235 9.8457 0.0003 0.0424 0.0246 269.5495 0.2329 0.0059 0.5302 0.0028 10.3644 0.0004 84.3632 0.0010 0.0007 207.5894 0.0554 96.9248 0.3300 0.0013 15.3002 0.0005 49.0034 5.0701 0.0020 11.0205 0.0207 20.6087 39.7985 39.1570 0.3013 536.6228 0.0070 52.7686 37.3954 222.8065 0.5416 0.0015 25.1287 29.0535 60.4201 24.0779 49.5173 0.0020 20.2407 1.8404 1.9267 13.3212 11.0995
temp: 298.150 k
press: 1.00000 atm
elementType: 8 8 7 7 6 6 6 6 6 6 6 6 1 1 1 1 1 1 1 1 1 1 1 1 1 1 1 1
symmnumber: 1
zpe: 621833.1 jmol-1
zpe.correction: 0.236844 hartree
zpe.thermalcorrener: 0.251434 hartree
zpe.thermalcorrenthalpy: 0.252378 hartree
zpe.thermalcorrgfe: 0.193509 hartree
zpe.sumelectzpe: -573.442500 hartree
zpe.sumelectthermal: -573.427910 hartree
zpe.sumelectthermalent: -573.426966 hartree
zpe.sumelectthermalfe: -573.485835 hartree
dipole: -0.0012 -0.0006 0.0292
dipole: 0.0292
quadrupole: -50.7842 -81.8737 -72.7756
quadrupole: 15.1287 0.0103 0.0020
quadrupole: 17.6936 -13.3959 -4.2978 15.1287 0.0103 0.0020
hfenergy: -573.6793438 hartree
pointgroup: C01 [X(C8H16N2O2)]
dipole: -0.0004625 -0.0002267 0.0114891 debye
polarizability: 142.3972314|13.3635287|108.8960447|0.0291042|-0.0085538|73.3754711 unknown
InChI: InChI=1S/C8H16N2O2/c1-9(2)7(11)5-6-8(12)10(3)4/h5-6H2,1-4H3
charge 0 multiplicity 1
28 atoms
O  1.839647 -1.705474 -0.005001
O  -1.832755 1.693411 -0.007023
N  3.128902 0.230061 0.000136
N  -3.122561 -0.242179 0.001815
C  0.633951 0.432583 0.003367
C  -0.627584 -0.444612 0.005492
C  1.902509 -0.431153 -0.001038
C  -1.896066 0.419182 0.00265
C  3.302092 1.689057 0.005744
C  4.371457 -0.560155 -0.001872
C  -4.365494 0.547377 -0.004646
C  -3.295454 -1.701331 0.005654
H  0.612163 1.103246 -0.875583
H  0.617019 1.101281 0.8839
H  -0.608763 -1.111673 0.887233
H  -0.607667 -1.116836 -0.872317
H  3.874338 2.015438 -0.885295
H  3.861722 2.011109 0.906427
H  2.334481 2.20823 -0.000061
H  4.100036 -1.626353 -0.006244
H  4.976543 -0.337798 0.898444
H  4.978015 -0.330644 -0.899361
H  -4.96834 0.317964 -0.9047
H  -4.094406 1.613657 -0.007286
H  -4.973792 0.323739 0.893178
H  -2.327922 -2.220558 0.009189
H  -3.859317 -2.02837 -0.89049
H  -3.863254 -2.023197 0.901187
