program: Gaussian 09
title: 000253042
version: EM64L-G09RevD.01
frameworkgroup: C1[X(C8H13N3O3)]
method: RPBEPBE
basis: SDD
operation: Freq
keyword: #p
keyword: freq=noraman
keyword: PBEPBE/SDD
title: #p freq=noraman PBEPBE/SDD
converged: YES YES NO NO
title: Mulliken charges:
elementType: O O O N N N C C C C C C C C H H H H H H H H H H H H H
charge: -0.277111 -0.314964 -0.241235 -0.397365 -0.374175 -0.037860 -0.377035 -0.489263 -0.435787 0.334503 0.277197 -0.224131 -0.688720 -0.120732 0.228324 0.266714 0.258530 0.294371 0.304366 0.295974 0.305229 0.248624 0.227673 0.233303 0.211918 0.275179 0.216471
chargesum: 0.00000
title: Mulliken charges with hydrogens summed into heavy atoms:
elementType: O O O N N N C C C C C C C C
charge: -0.277111 -0.314964 -0.241235 -0.092998 -0.078201 -0.037860 0.118003 0.063638 0.118067 0.334503 0.277197 0.236845 0.014849 -0.120732
polarizability: 1.25511728e+02 -2.86395393e-02 1.19479662e+02 5.16087070e-01 8.33584750e+00 8.96076828e+01
1716.lowfreq: -4.2157 -0.0004 0.0006 0.0008 4.6007 9.8683 29.5568 39.5495 46.8635
frequency: 29.5232 39.4945 46.8323 52.0136 72.9215 81.7629 119.4935 140.9661 152.1424 166.3516 235.4966 261.8385 262.9763 299.9035 326.3225 350.7189 375.2223 386.8209 424.6203 537.8651 550.7364 557.6140 583.8859 611.2918 683.7434 724.0082 795.8130 801.9247 811.9492 849.1531 900.0073 903.8834 1000.7890 1016.9127 1021.2301 1061.6029 1076.6740 1112.0588 1137.0184 1166.3174 1194.6698 1205.4014 1229.7892 1246.9105 1251.2387 1270.2277 1315.9586 1330.5930 1356.1155 1362.5846 1407.7740 1431.0662 1443.9861 1447.6699 1467.3154 1472.3396 1476.3090 1492.3163 1514.0862 1633.7153 1641.1570 2193.9427 2992.6159 3005.3921 3012.1731 3015.7262 3029.7413 3067.4957 3071.2118 3078.9566 3088.5563 3099.2925 3105.8820 3549.9403 3559.9987
redmass: 7.8204 4.1176 7.5668 5.6626 3.0789 5.0496 3.3473 3.6884 2.4442 3.8345 2.2861 1.6365 1.6085 2.9905 4.8216 2.3441 3.0044 2.4144 5.1011 2.7562 1.9825 2.6075 3.6284 3.7380 3.9364 9.4503 3.2534 1.2085 2.4424 3.2480 4.6334 2.7205 2.7505 2.3436 2.4599 2.3176 4.9319 2.2647 1.4631 5.4466 3.1205 1.1878 1.2779 1.2983 1.1755 1.5644 1.2011 1.2924 1.3777 1.2547 1.2471 1.0932 1.1941 1.0972 1.0400 1.3717 1.0730 1.0597 2.2561 4.8476 10.3551 12.3956 1.0361 1.0586 1.0582 1.0621 1.0609 1.1008 1.1064 1.0992 1.0986 1.1061 1.1031 1.0776 1.0773
irintensity: 2.1993 0.3741 3.0190 5.5642 5.1632 19.0531 12.8831 0.4230 2.5845 8.4401 8.3399 0.4186 1.9370 31.1801 7.3033 2.6733 2.2853 13.0761 13.4484 36.1085 87.7826 130.1861 7.3753 53.8185 10.2159 41.6793 5.2770 3.6747 3.4094 4.9117 45.0091 14.9867 1.8317 3.9493 69.5818 3.7254 13.1724 6.9365 4.5337 211.6804 60.7573 34.2359 27.9210 49.2773 16.4146 124.6733 28.7392 10.7261 0.3225 6.1223 18.5645 29.9743 32.9306 18.1412 13.2264 20.8955 4.7144 10.4814 481.8035 176.6094 187.1002 17.3936 18.2227 12.3862 21.6988 31.4463 35.6087 8.2977 9.5537 3.1997 27.6647 8.3044 26.3261 7.4627 22.5804
temp: 298.150 k
press: 1.00000 atm
elementType: 8 8 8 7 7 7 6 6 6 6 6 6 6 6 1 1 1 1 1 1 1 1 1 1 1 1 1
symmnumber: 1
zpe: 561001.0 jmol-1
zpe.correction: 0.213674 hartree
zpe.thermalcorrener: 0.229575 hartree
zpe.thermalcorrenthalpy: 0.230519 hartree
zpe.thermalcorrgfe: 0.168315 hartree
zpe.sumelectzpe: -701.500102 hartree
zpe.sumelectthermal: -701.484202 hartree
zpe.sumelectthermalent: -701.483257 hartree
zpe.sumelectthermalfe: -701.545461 hartree
dipole: -2.2052 0.4953 3.3717
dipole: 4.0592
quadrupole: -76.5795 -94.7909 -79.1330
quadrupole: 6.0821 4.9782 -6.2491
quadrupole: 6.9216 -11.2898 4.3682 6.0821 4.9782 -6.2491
hfenergy: -701.7137765 hartree
pointgroup: C01 [X(C8H13N3O3)]
dipole: 0.9845014 0.0727487 -1.2553378 debye
polarizability: 125.2222933|-0.7841009|120.727786|1.1805615|-6.2906734|88.648993 unknown
InChI: InChI=1S/C8H13N3O3/c1-2-14-7(12)6-11-8(13)10-5-3-4-9/h10-11H,2-3,5-6H2,1H3
charge 0 multiplicity 1
27 atoms
O  -1.809073 0.820946 -0.218069
O  0.511113 -2.205847 0.921972
O  -3.669099 -0.199311 0.759133
N  1.675305 -1.131597 -0.791881
N  -0.652759 -1.457138 -0.974605
N  2.2874 2.27027 0.501714
C  2.929402 -1.173397 -0.037209
C  -1.956445 -1.596175 -0.338156
C  2.924054 -0.219693 1.201443
C  0.50571 -1.628678 -0.212081
C  -2.585426 -0.276561 0.139526
C  -2.290651 2.165004 0.244221
C  -1.313894 3.199019 -0.305293
C  2.59611 1.165442 0.832493
H  3.756071 -0.913363 -0.719651
H  3.091315 -2.197247 0.340383
H  -2.682645 -2.089506 -1.009956
H  -1.832288 -2.246676 0.545449
H  1.624897 -0.526932 -1.61246
H  -0.608175 -0.873184 -1.811021
H  2.163734 -0.594297 1.911514
H  3.908351 -0.251215 1.704936
H  -3.322607 2.305796 -0.125113
H  -2.31671 2.149944 1.348553
H  -1.614872 4.206825 0.03531
H  -0.284997 3.009351 0.045151
H  -1.314419 3.196821 -1.409401
