program: Gaussian 09
title: 000253036
version: EM64L-G09RevD.01
frameworkgroup: C1[X(C19H14O2)]
method: RPBEPBE
basis: SDD
operation: Freq
keyword: #pfreq=noraman
keyword: PBEPBE/SDD
title: #p freq=noraman PBEPBE/SDD
converged: YES YES NO NO
title: Mulliken charges:
elementType: O O C C C C C C C C C C C C C C C C C C C H H H H H H H H H H H H H H
charge: -0.313224 -0.257001 0.259265 0.319906 0.401893 -0.428527 -0.461719 -0.368226 -0.357719 -0.336953 0.490866 0.205092 -0.301669 -0.236909 -0.225247 -0.380387 -0.394365 -0.235071 -0.237664 -0.237451 -0.237012 0.253831 0.257849 0.235656 0.252919 0.235039 0.246134 0.233197 0.230542 0.226152 0.230699 0.234742 0.230387 0.231076 0.233897
chargesum: 0.00000
title: Mulliken charges with hydrogens summed into heavy atoms:
elementType: O O C C C C C C C C C C C C C C C C C C C
charge: -0.313224 -0.257001 0.259265 0.319906 0.401893 -0.174696 -0.203870 -0.132570 -0.104800 -0.101913 0.490866 0.205092 -0.055535 -0.003712 0.005296 -0.154235 -0.163666 -0.000329 -0.007276 -0.006375 -0.003114
polarizability: 3.78761561e+02 -3.87979317e+01 2.98396938e+02 7.01996776e+00 -4.01599623e-01 8.26522279e+01
1716.lowfreq: -0.0007 0.0004 0.0007 2.1160 3.9629 7.2355 24.1450 28.1830 40.3704
frequency: 24.0895 28.1385 40.3556 51.0650 86.9786 108.0443 116.4796 159.0925 175.4424 218.3040 237.5497 240.6267 278.4962 308.5975 360.6525 399.7380 402.6429 429.0620 454.0098 489.0940 494.8227 538.5099 553.7263 615.2823 615.9531 619.1721 626.6790 636.3833 684.9606 691.6115 694.5280 698.3109 770.1454 779.5707 836.3086 839.8265 845.8094 852.0557 859.8089 872.1983 890.2540 897.3570 924.6259 931.4225 942.5356 978.0147 981.8033 984.0792 988.1258 989.6675 1000.9755 1001.9186 1020.3366 1026.5987 1038.6521 1084.6336 1087.4651 1169.3722 1174.6614 1175.8939 1191.6645 1193.9925 1219.6369 1243.8716 1246.0930 1289.0896 1301.2161 1306.5379 1329.8119 1338.6790 1346.1079 1385.2380 1387.9496 1438.8988 1440.9742 1480.7903 1484.6077 1542.9431 1566.5334 1582.6992 1586.7385 1609.7771 1614.1311 1627.7041 1647.6482 3117.8941 3122.1961 3128.0703 3131.5429 3136.8587 3140.6645 3141.5116 3151.8032 3153.2281 3165.4277 3167.8935 3173.2961 3176.8852 3183.7822
redmass: 3.6514 3.7580 5.6814 6.7507 5.1196 4.1816 5.2327 6.0336 5.5763 4.5461 6.3035 2.8737 3.7421 6.9184 5.9181 2.7975 2.7615 5.1811 3.8402 2.9142 9.1306 5.4493 5.9100 6.1941 6.4290 4.8539 4.5242 7.0261 2.1810 5.6761 1.6747 2.0253 1.7977 1.8504 4.7358 1.4049 1.2852 1.3568 5.8164 1.6761 1.7899 4.5967 1.4700 1.6330 2.9833 1.3254 1.4083 1.2807 6.0584 5.2035 1.3167 1.3279 3.7752 2.1839 2.2501 1.6353 1.5910 1.9691 1.0609 1.0545 1.1269 1.1269 1.5015 1.4804 3.3157 2.5232 1.9612 1.6513 1.5963 1.3498 3.7121 8.2389 6.8588 2.3304 2.3346 2.3246 2.3039 9.5695 7.4625 5.6962 6.0433 5.9661 6.0659 6.7771 6.0629 1.0910 1.0877 1.0864 1.0851 1.0885 1.0885 1.0909 1.0961 1.0937 1.0973 1.1016 1.0926 1.0983 1.0921
irintensity: 0.0178 0.2020 0.2420 0.1488 0.0290 1.3907 0.5438 6.7679 0.1024 0.2618 1.9574 0.5627 0.3347 0.0386 5.5183 0.0033 0.0532 6.8526 3.2988 9.2166 1.2049 4.4957 17.1241 0.8807 0.1344 1.9006 11.8155 5.5167 16.6945 2.2911 20.3555 60.5192 67.7529 44.4545 2.6198 1.6017 0.0310 4.7544 15.8320 25.2549 23.8089 10.3634 0.6848 4.9483 17.2916 11.5430 10.4069 31.1374 1.1718 1.8689 6.1156 2.1871 34.8792 3.5784 5.5620 11.1445 10.5304 22.2260 0.3603 0.2832 13.8386 4.5973 12.8688 6.6021 12.5823 33.9478 57.0562 47.6266 47.9779 4.0371 312.8110 5.6664 3.2832 34.5366 5.8830 19.3361 8.9519 137.4995 129.5126 3.5066 50.9483 7.7650 3.5955 216.1837 185.8425 1.1762 9.7705 5.1060 0.7227 17.2508 4.6206 1.2215 36.8044 22.0178 27.4513 33.9537 6.7717 8.3019 4.8369
temp: 298.150 k
press: 1.00000 atm
elementType: 8 8 6 6 6 6 6 6 6 6 6 6 6 6 6 6 6 6 6 6 6 1 1 1 1 1 1 1 1 1 1 1 1 1 1
symmnumber: 1
zpe: 708888.5 jmol-1
zpe.correction: 0.270001 hartree
zpe.thermalcorrener: 0.287152 hartree
zpe.thermalcorrenthalpy: 0.288096 hartree
zpe.thermalcorrgfe: 0.222564 hartree
zpe.sumelectzpe: -881.416260 hartree
zpe.sumelectthermal: -881.399109 hartree
zpe.sumelectthermalent: -881.398165 hartree
zpe.sumelectthermalfe: -881.463697 hartree
dipole: 2.8865 -5.5341 -0.0313
dipole: 6.2417
quadrupole: -97.7721 -129.9120 -129.6361
quadrupole: 19.6318 2.2518 -0.5039
quadrupole: 21.3346 -10.8052 -10.5293 19.6318 2.2518 -0.5039
hfenergy: -881.6862614 hartree
pointgroup: C01 [X(C19H14O2)]
dipole: 1.1145022 -2.1859341 0.0997967 debye
polarizability: 377.8571401|-39.0748524|298.6078264|11.4010942|-10.9329507|83.3457605 unknown
InChI: InChI=1S/C19H14O2/c20-17-13-18(12-11-15-7-3-1-4-8-15)21-19(14-17)16-9-5-2-6-10-16/h1-14H
charge 0 multiplicity 1
35 atoms
O  -0.807827 0.458995 -0.045138
O  -2.503938 4.256819 -0.21368
C  -2.210157 0.606507 -0.061295
C  -2.908029 -0.696282 -0.007893
C  0.019105 1.59994 -0.075416
C  -2.780722 1.857638 -0.108263
C  -0.527407 2.866888 -0.131557
C  -4.29096 -0.791349 -0.327529
C  -2.20851 -1.876002 0.36752
C  1.442357 1.30216 -0.052192
C  3.404147 -0.309701 -0.012325
C  -1.97835 3.091808 -0.15768
C  1.977833 0.039401 -0.03781
C  -4.955983 -2.031635 -0.262236
C  -2.877387 -3.115763 0.430144
C  4.448412 0.661744 0.027324
C  3.76929 -1.68763 -0.027667
C  -4.253779 -3.200154 0.117762
C  5.799251 0.26655 0.048408
C  5.122268 -2.083861 -0.006584
C  6.144694 -1.107749 0.031319
H  -3.867129 1.970468 -0.090403
H  0.131018 3.739661 -0.158822
H  -4.844856 0.098032 -0.645285
H  -1.146098 -1.809295 0.617268
H  2.085951 2.189386 -0.052662
H  1.277246 -0.806026 -0.053043
H  -6.020105 -2.08938 -0.515146
H  -2.326508 -4.015165 0.72604
H  4.20462 1.729712 0.04392
H  2.978922 -2.447917 -0.058511
H  -4.77313 -4.163376 0.166072
H  6.588188 1.026174 0.079089
H  5.380029 -3.148452 -0.020011
H  7.197242 -1.410846 0.04808
