program: Gaussian 09
title: 000253034
version: EM64L-G09RevD.01
frameworkgroup: C1[X(C24H28O5)]
method: RPBEPBE
basis: SDD
operation: Freq
keyword: #pfreq=noraman
keyword: PBEPBE/SDD
title: #p freq=noraman PBEPBE/SDD
converged: YES YES NO NO
title: Mulliken charges:
elementType: O O O O O C C C C C C C C C C C C C C C C C C C C C C C C H H H H H H H H H H H H H H H H H H H H H H H H H H H H
charge: -0.298100 -0.249605 -0.195247 -0.239947 -0.252161 -0.214759 -0.560572 -0.559314 0.473440 0.346079 0.273578 0.184933 -0.392551 -0.445972 -0.654996 -0.708587 -0.740457 -0.718081 -0.243593 -0.232472 0.137510 -0.245101 0.306265 -0.332844 -0.330265 -0.354508 -0.371603 0.328462 -0.536600 0.251688 0.247039 0.245975 0.236727 0.284943 0.254662 0.241651 0.274267 0.270920 0.265463 0.217411 0.209863 0.204435 0.272069 0.257985 0.202521 0.244416 0.223442 0.228738 0.225165 0.229372 0.273910 0.252122 0.259212 0.246145 0.227944 0.226529 0.252452
chargesum: 0.00000
title: Mulliken charges with hydrogens summed into heavy atoms:
elementType: O O O O O C C C C C C C C C C C C C C C C C C C C C C C C
charge: -0.298100 -0.249605 -0.195247 -0.239947 -0.252161 0.036929 -0.067557 -0.037644 0.473440 0.346079 0.273578 0.184933 -0.137889 -0.204320 -0.109809 -0.015851 -0.005968 -0.047702 -0.014855 -0.007306 0.137510 -0.015729 0.306265 -0.058934 -0.078143 -0.095296 -0.125457 0.328462 0.170325
polarizability: 3.20767834e+02 9.30357192e+00 3.04699999e+02 -5.13693263e+01 1.02967135e+01 2.14987952e+02
1716.lowfreq: -8.7427 -6.1627 -1.8731 -0.0003 0.0002 0.0003 7.5299 10.3206 18.4020
frequency: 6.8414 10.1048 18.3445 21.1251 31.8983 36.7760 53.6624 59.2828 68.9239 76.6158 84.7200 94.6576 111.0097 126.5177 135.0174 154.4282 167.0526 178.4112 190.7032 216.1564 226.0935 228.2852 233.5057 252.5549 260.6531 278.8576 290.6355 302.3956 317.7102 331.7509 341.2741 392.4966 401.9786 409.4405 410.0816 414.2128 430.6929 438.6920 451.3093 469.0845 484.0937 513.1294 531.2599 541.1222 559.3296 589.6827 599.5281 617.2471 621.4564 629.5240 660.5480 706.1968 729.5163 737.8737 739.5844 760.0242 773.4543 799.6199 803.7352 810.2278 814.7982 850.8672 855.9620 897.0491 899.5676 918.4218 922.0318 925.6514 931.4163 954.8068 959.6577 961.2464 978.1795 980.0135 988.1303 990.5412 995.9811 996.4782 1005.8684 1022.2219 1030.5601 1032.8966 1039.0018 1057.7610 1085.0591 1112.1258 1115.1834 1117.9499 1143.6182 1154.8494 1158.3431 1172.7070 1181.5020 1187.2968 1192.0333 1206.5272 1223.1196 1231.8042 1242.7326 1254.4748 1258.4750 1263.9026 1273.1204 1297.3051 1299.3104 1304.3931 1316.8492 1322.4149 1354.5165 1375.2106 1376.7861 1381.4229 1383.3605 1402.8538 1421.8526 1432.1364 1434.2053 1437.3279 1441.2567 1446.2306 1447.7131 1468.1790 1469.0102 1469.1719 1470.8448 1475.8845 1480.5001 1483.8416 1498.8876 1505.4597 1551.6517 1586.6485 1590.5516 1612.0735 1619.7492 1624.1122 1626.5061 2969.8696 2974.0237 2987.5622 2988.9733 2989.4895 2994.2103 3007.2457 3009.7270 3048.9875 3062.2713 3062.5102 3079.2904 3084.1623 3084.7003 3092.9648 3096.4347 3109.4700 3113.2325 3117.1296 3125.6408 3134.8870 3136.2864 3146.5832 3147.2587 3151.3239 3163.5660 3169.2410 3173.9712
redmass: 5.2362 5.0387 4.5931 3.9849 3.7760 4.0110 4.6593 7.8703 4.1608 5.3108 6.3980 5.5399 4.4579 4.1611 4.5213 4.5284 4.1936 1.0594 3.3808 1.2283 3.3195 3.6216 1.0634 3.0777 1.1222 5.3429 3.8398 3.0339 3.0930 2.6435 2.9348 3.1632 2.8218 3.7800 3.1148 2.9593 4.8082 2.6934 3.2902 4.2492 2.9106 3.4152 2.3616 4.3634 3.7184 3.7963 4.3821 6.3274 3.8331 6.4541 4.2261 1.7324 5.5013 3.9560 4.2903 3.0950 2.5269 3.5268 3.8733 3.8293 1.3532 1.4975 1.2472 2.6650 2.2851 1.5868 1.5071 1.8963 2.1516 2.2090 1.2143 1.7113 4.4115 1.5290 4.9111 5.6482 1.3593 1.3461 2.2947 2.8179 1.4245 2.2691 1.5690 2.8884 1.6692 1.2601 1.3273 1.8692 1.3244 1.3300 1.7461 1.0595 1.3074 1.4621 1.1476 2.3755 2.0989 2.2795 2.9412 2.4369 2.9117 1.4034 2.8438 2.0364 1.3976 1.3551 1.5182 1.2919 1.4822 1.2345 4.9436 1.2367 4.9411 1.2132 1.1173 1.8734 1.6096 1.2087 2.0493 1.0875 1.0476 1.0578 1.0545 1.0498 1.0740 1.0663 1.0518 2.2578 2.4801 1.0583 7.0434 7.8633 5.9190 6.0683 6.3639 9.1306 9.3472 1.0326 1.0624 1.0357 1.0435 1.0532 1.0369 1.0712 1.0726 1.0952 1.1044 1.0982 1.0990 1.0986 1.1011 1.0989 1.1005 1.0876 1.1002 1.1001 1.0859 1.1000 1.0913 1.0875 1.0955 1.0884 1.1014 1.0951 1.0971
irintensity: 0.0451 0.3561 0.3785 0.3049 2.1347 0.1822 0.8527 2.2521 0.5857 0.1142 0.2030 6.1724 0.9363 2.2907 10.4216 0.8259 4.4425 0.0608 1.9002 0.1317 0.4424 0.8677 0.4736 6.5605 0.8071 14.7184 1.6383 5.6063 2.2841 1.8628 2.7954 4.1030 0.1036 1.9243 2.2625 0.0179 0.6308 3.6046 6.8174 0.3021 3.6135 16.6310 9.1453 22.0465 9.5115 22.8149 18.2227 0.8322 9.3844 3.8368 5.9825 54.1774 3.0372 6.1389 8.0023 24.3090 12.8844 4.0557 5.4184 1.4573 24.9101 57.7133 0.2012 7.4675 41.1176 1.3330 1.0436 2.4847 32.2776 3.0268 0.2731 4.5754 74.6083 7.1772 13.6159 0.7391 0.3709 1.2300 5.9008 21.7065 0.0443 4.0869 0.1598 5.2615 47.1416 0.1902 26.6504 88.4577 18.3805 15.1505 201.9005 1.0962 267.0659 7.4246 0.7544 1.6811 157.9834 64.1011 200.5048 67.5794 22.9152 22.2421 14.4496 199.3135 22.5655 51.4047 20.2089 4.1342 4.6261 36.2065 6.4826 33.7685 1.9063 35.1528 37.0154 88.9196 8.9282 3.2225 18.7206 13.3940 2.6771 6.3385 18.6940 2.3173 33.8347 10.9399 5.2477 16.1131 22.7283 19.8115 244.3058 103.4304 2.6271 8.0277 228.0518 112.6338 174.3895 65.0745 10.8387 13.7277 22.9966 0.9316 33.1934 4.0815 17.9122 9.4498 39.8407 10.1935 10.4069 1.6119 15.0952 58.3872 31.4724 9.6674 4.4622 10.7439 0.1909 22.9786 15.9494 7.1079 30.6312 0.5501 23.8521 10.8179 5.1884
temp: 298.150 k
press: 1.00000 atm
elementType: 8 8 8 8 8 6 6 6 6 6 6 6 6 6 6 6 6 6 6 6 6 6 6 6 6 6 6 6 6 1 1 1 1 1 1 1 1 1 1 1 1 1 1 1 1 1 1 1 1 1 1 1 1 1 1 1 1
symmnumber: 1
zpe: 1215072.6 jmol-1
zpe.correction: 0.462797 hartree
zpe.thermalcorrener: 0.492678 hartree
zpe.thermalcorrenthalpy: 0.493622 hartree
zpe.thermalcorrgfe: 0.396654 hartree
zpe.sumelectzpe: -1305.328966 hartree
zpe.sumelectthermal: -1305.299084 hartree
zpe.sumelectthermalent: -1305.298140 hartree
zpe.sumelectthermalfe: -1305.395109 hartree
dipole: 6.4773 -2.3081 -5.2048
dipole: 8.6240
quadrupole: -154.4085 -158.5218 -183.9394
quadrupole: -5.0975 -0.9349 5.6625
quadrupole: 11.2147 7.1015 -18.3162 -5.0975 -0.9349 5.6625
hfenergy: -1305.7917624 hartree
pointgroup: C01 [X(C24H28O5)]
dipole: 1.687632 0.4995295 2.9007585 debye
polarizability: 308.9433615|-32.1712408|262.3673262|49.2571484|44.5672325|269.1450976 unknown
InChI: InChI=1S/C24H28O5/c1-24(2,3)29-23(27)15-19(17-8-6-5-7-9-17)14-20(25)16-22(26)18-10-12-21(28-4)13-11-18/h5-13,19H,14-16H2,1-4H3
charge 0 multiplicity 1
57 atoms
O  -1.123559 -3.036481 -0.605837
O  -2.721923 -3.219329 -2.318924
O  -1.278152 2.541466 -2.39118
O  1.200872 -0.275419 -1.618013
O  5.900131 0.870069 2.59441
C  -2.166684 -0.321352 -0.2773
C  -3.031616 -1.610447 -0.471548
C  -1.804258 0.282876 -1.661816
C  -2.892206 0.647471 0.660416
C  -0.140289 -4.053844 -1.197511
C  -2.307606 -2.702557 -1.253853
C  -1.004488 1.579282 -1.624981
C  -3.807576 1.621592 0.1839
C  -2.685137 0.545203 2.061672
C  0.153541 1.708887 -0.627332
C  -0.826462 -5.432469 -1.263095
C  0.340364 -3.553495 -2.573622
C  0.997393 -4.030685 -0.162689
C  -4.496174 2.466663 1.083572
C  -3.371821 1.387301 2.964014
C  1.270932 0.658412 -0.761287
C  -4.283078 2.353155 2.476421
C  2.450904 0.776931 0.145132
C  3.507331 -0.173925 0.014668
C  2.570503 1.788615 1.13436
C  4.635605 -0.116975 0.839304
C  3.699533 1.859265 1.974081
C  4.737682 0.90216 1.826193
C  6.075622 1.899754 3.626708
H  -1.232783 -0.653133 0.215623
H  -3.965207 -1.371507 -1.009363
H  -3.300953 -2.007699 0.524916
H  -2.70324 0.456605 -2.279999
H  -1.169318 -0.449691 -2.199248
H  -3.980288 1.733958 -0.892112
H  -1.980288 -0.203874 2.446237
H  0.582489 2.720889 -0.749391
H  -0.262177 1.656459 0.400501
H  -1.652279 -5.428656 -1.991538
H  -1.220545 -5.718559 -0.271536
H  -0.086373 -6.193664 -1.57173
H  1.149971 -4.214744 -2.934485
H  0.740356 -2.527998 -2.491826
H  -0.477585 -3.569772 -3.311101
H  1.787621 -4.743594 -0.459705
H  1.438565 -3.020935 -0.10044
H  0.623745 -4.315754 0.836159
H  -5.195827 3.215825 0.696052
H  -3.196853 1.292455 4.041849
H  -4.817367 3.009622 3.172272
H  3.412289 -0.947709 -0.754176
H  1.779492 2.535094 1.259937
H  5.452764 -0.838389 0.747425
H  3.763412 2.650501 2.726546
H  6.097723 2.911979 3.180312
H  5.275028 1.84133 4.38833
H  7.047045 1.675633 4.089631
