program: Gaussian 09
title: 000023742
version: EM64L-G09RevD.01
frameworkgroup: C1[X(C5H6N2)]
method: RPBEPBE
basis: SDD
operation: Freq
keyword: #p
keyword: freq=noraman
keyword: PBEPBE/SDD
title: #p freq=noraman PBEPBE/SDD
converged: YES YES YES YES
title: Mulliken charges:
elementType: N N C C C C C H H H H H H
charge: 0.018183 0.018209 0.197039 -0.660599 -0.660595 -0.176947 -0.177002 0.247681 0.236591 0.236591 0.236585 0.247673 0.236591
chargesum: 0.00000
title: Mulliken charges with hydrogens summed into heavy atoms:
elementType: N N C C C C C
charge: 0.018183 0.018209 0.197039 0.060264 0.060254 -0.176947 -0.177002
polarizability: 7.00076908e+01 5.51716802e-04 5.72746197e+01 -9.42928207e-04 -1.05129019e-03 4.76088901e+01
1716.lowfreq: -12.9868 -0.6751 -0.0004 -0.0002 0.0007 4.1021 129.0133 174.6635 183.4860
frequency: 129.0133 174.6625 183.4854 209.0716 228.2750 276.1085 337.1322 467.5159 503.5905 565.7243 583.1232 654.6770 873.2466 936.8586 938.5824 1022.9359 1122.6270 1185.0419 1215.4128 1382.3470 1401.6074 1459.4882 1463.4432 1474.2614 1485.8183 2196.6267 2198.1534 3006.2988 3006.8703 3112.9392 3116.6536 3119.7055 3122.2813
redmass: 9.8552 2.7664 5.4605 1.1101 1.5703 1.7330 2.4894 5.9412 6.9108 12.2303 5.6600 5.1338 2.0811 2.4553 1.6408 1.2776 3.3353 2.2985 2.7027 1.1620 1.1750 1.0469 1.0459 1.0461 1.0536 12.6506 12.6351 1.0338 1.0342 1.1022 1.1015 1.1023 1.1022
irintensity: 6.0021 0.0000 5.3354 0.0000 0.0117 0.0517 0.4920 0.3555 0.0000 0.4399 2.5559 4.9195 0.1438 0.3441 1.3344 0.0000 6.8308 13.3675 40.5617 12.9813 7.2133 9.6413 0.0000 12.3026 19.9712 1.6422 1.9695 8.9489 10.7663 0.0000 27.5690 10.5860 14.3451
temp: 298.150 k
press: 1.00000 atm
elementType: 7 7 6 6 6 6 6 1 1 1 1 1 1
symmnumber: 1
zpe: 258115.7 jmol-1
zpe.correction: 0.098311 hartree
zpe.thermalcorrener: 0.106138 hartree
zpe.thermalcorrenthalpy: 0.107082 hartree
zpe.thermalcorrgfe: 0.066720 hartree
zpe.sumelectzpe: -303.074727 hartree
zpe.sumelectthermal: -303.066901 hartree
zpe.sumelectthermalent: -303.065956 hartree
zpe.sumelectthermalfe: -303.106318 hartree
dipole: 0.0004 4.5757 0.0007
dipole: 4.5757
quadrupole: -55.2314 -43.7741 -38.1490
quadrupole: 0.0005 -0.0009 -0.0007
quadrupole: -9.5132 1.9440 7.5692 0.0005 -0.0009 -0.0007
hfenergy: -303.1730383 hartree
pointgroup: C01 [X(C5H6N2)]
dipole: 0.0000513 1.8002364 -0.0001796 debye
dipolederiv: -0.2026466 0.0110897 0.0000533 -0.0047718 -0.1810882 -0.0000425 0.0000137 -0.00002 -0.1935849 -0.2028113 -0.0109552 -0.0001397 0.0047191 -0.18096 -0.0001264 -0.0000189 -0.0000351 -0.1935592 0.3932071 -0.0000494 -0.0000663 0.0000301 0.2379588 0.0000133 -0.0001069 -0.0000461 0.2664806 -0.0517295 0.0000358 0.0000634 0.0000178 0.0519687 0.0171634 0.0000487 0.0539802 0.045589 -0.0516625 0.0000037 0.0000391 0.0000143 0.0520061 -0.0171718 0.0000758 -0.053949 0.0455915 0.0094018 -0.1330306 -0.0000912 -0.0813996 -0.0687792 0.0000855 -0.0000819 0.0000893 -0.0954989 0.0096613 0.1329129 0.0000692 0.0813665 -0.0689725 0.0000797 0.0000231 0.0000164 -0.0955429 0.1174608 0.0000233 -0.000082 0.0000424 0.0273008 0.0985643 -0.0000888 0.059554 -0.0502042 -0.034591 -0.1105918 0.0046166 -0.1039244 0.0258287 -0.0249131 0.0128338 -0.0074389 0.0802305 -0.0345695 0.1105884 -0.0044982 0.1039154 0.0258036 -0.0250245 -0.0127079 -0.00755 0.0802436 -0.0345516 0.1106108 0.0046234 0.103953 0.0257823 0.0249102 0.0128487 0.0074184 0.0802287 0.1174674 -0.0000429 -0.0001031 -0.0000693 0.0273135 -0.0985638 -0.0001026 -0.0595552 -0.0502251 -0.0346363 -0.1105948 -0.0044847 -0.1038935 0.0258373 0.0250256 -0.0127369 0.007536 0.0802514 unknown
polarizability: 70.0076801|0.001316|57.2746187|-0.0153843|-0.0035659|47.6089019 unknown
InChI: InChI=1S/C5H6N2/c1-5(2,3-6)4-7/h1-2H3
charge 0 multiplicity 1
13 atoms
N  2.204195 -1.100021 -0.001126
N  -2.204165 -1.100109 0.001571
C  -0.000008 0.425327 -0.000068
C  0.000755 1.314201 1.287548
C  -0.000568 1.314316 -1.287602
C  1.210836 -0.440627 -0.000749
C  -1.211058 -0.440339 0.000526
H  0.001195 0.694203 2.198353
H  0.898894 1.954204 1.290128
H  -0.897271 1.954354 1.291103
H  -0.898557 1.954529 -1.290121
H  -0.001155 0.694402 -2.198464
H  0.897608 1.954259 -1.2911
