program: Gaussian 09
title: 000253021
version: EM64L-G09RevD.01
frameworkgroup: C1[X(C26H22N2)]
method: RPBEPBE
basis: SDD
operation: Freq
keyword: #pfreq=noraman
keyword: PBEPBE/SDD
title: #p freq=noraman PBEPBE/SDD
converged: YES YES NO NO
title: Mulliken charges:
elementType: N N C C C C C C C C C C C C C C C C C C C C C C C C C C H H H H H H H H H H H H H H H H H H H H H H
charge: -0.250925 -0.047855 -0.592237 0.492070 0.474685 -0.071500 0.313399 0.304531 -0.378471 -0.384671 -0.405901 -0.327194 -0.381332 -0.385737 -0.389431 -0.341950 -0.230898 -0.233390 -0.217991 -0.210116 -0.240968 -0.253930 -0.239192 -0.233231 -0.236768 -0.224454 -0.248025 -0.241799 0.217952 0.243827 0.238693 0.247732 0.241756 0.255081 0.253385 0.259819 0.266987 0.253058 0.224738 0.225730 0.224428 0.225309 0.227088 0.227250 0.223833 0.226030 0.222631 0.224844 0.226146 0.226964
chargesum: 0.00000
title: Mulliken charges with hydrogens summed into heavy atoms:
elementType: N N C C C C C C C C C C C C C C C C C C C C C C C C C C
charge: -0.250925 -0.047855 -0.130458 0.492070 0.474685 -0.071500 0.313399 0.304531 -0.139778 -0.136939 -0.164145 -0.072113 -0.127947 -0.125918 -0.122444 -0.088892 -0.006160 -0.007660 0.006436 0.015194 -0.013880 -0.026679 -0.015359 -0.007201 -0.014138 0.000390 -0.021879 -0.014835
polarizability: 3.23310246e+02 2.58003291e+01 3.77546060e+02 -1.51067674e+00 1.37420805e+01 2.05147640e+02
1716.lowfreq: -7.9323 0.0004 0.0005 0.0007 4.3515 5.6647 18.0619 20.4067 35.2826
frequency: 17.7547 20.2707 35.2137 39.1870 49.0247 55.3000 61.7036 73.5150 77.2675 99.0056 108.0081 164.7127 196.3592 216.6328 220.6403 236.1598 263.5681 286.4356 310.8788 374.0212 389.6886 399.9506 403.9420 407.7133 409.1425 439.8412 469.6368 477.1846 492.6756 501.2290 546.8036 583.3812 607.5628 610.5409 614.8905 615.9591 618.0850 642.9124 667.5609 697.0756 699.4318 703.2819 704.1328 716.0297 739.1410 758.1391 767.4534 778.8406 785.3493 815.4707 835.9231 851.3927 854.3028 857.2952 904.6908 909.0681 922.5312 926.3149 934.8077 948.1855 967.1885 975.5691 978.6320 982.0177 985.3504 987.8732 988.0181 989.3992 990.2581 993.8198 995.0605 995.5917 1005.5206 1023.7400 1026.0196 1027.7775 1031.5953 1063.3316 1081.2692 1083.5986 1088.1583 1096.2531 1170.1734 1170.3230 1172.0131 1172.2210 1177.9569 1183.2215 1187.9591 1188.7881 1190.6301 1193.1914 1209.5084 1290.8415 1294.7324 1314.4965 1316.3805 1325.4118 1332.5592 1340.2070 1371.9395 1378.1890 1380.0905 1385.1237 1431.0471 1432.6810 1440.8189 1441.4252 1463.5023 1473.8570 1474.7292 1478.5180 1483.4928 1508.8251 1579.2140 1582.8632 1586.8796 1593.7990 1602.9396 1605.9080 1608.7937 1612.2605 3037.5400 3098.4652 3118.3704 3121.3828 3121.6781 3123.1028 3124.0688 3128.8739 3131.1176 3131.3913 3136.7928 3141.4804 3143.9420 3147.2697 3147.3309 3150.5843 3155.9299 3157.6396 3162.2468 3164.0084 3167.1474 3167.7696
redmass: 5.6039 5.0749 4.9144 4.3273 3.9669 4.4442 4.0456 4.5950 3.9783 5.0730 4.8623 5.0407 4.7282 4.8171 4.9787 4.4408 5.0531 5.7585 5.3725 2.2985 3.9406 2.8373 2.8064 2.8671 2.8955 4.6139 4.7029 4.2433 5.6022 3.5614 3.9919 4.5152 5.5330 6.0867 5.7086 6.3724 6.1663 4.7546 5.1155 1.8315 1.7432 1.7201 1.7634 5.8780 2.7487 1.8647 2.0786 2.2919 2.8537 3.0504 1.2576 1.2493 1.2451 1.2437 1.6658 2.2563 1.5836 1.4652 1.6111 2.7532 1.3840 1.3941 1.4221 1.4515 1.6449 3.2971 4.2719 5.7726 5.1733 1.3628 1.3486 1.3308 3.3249 2.3794 2.1900 2.1074 1.9909 2.7796 1.6094 1.5772 1.6341 1.9265 1.0534 1.0533 1.0628 1.0540 1.3082 1.9606 1.2668 1.2008 1.4460 1.3465 2.8758 2.8385 1.8874 1.3571 1.3807 1.5480 1.2764 1.2297 6.7410 8.0415 7.8361 7.0131 2.3722 2.3009 2.3404 2.1419 1.1934 2.2150 2.2536 2.4008 2.0967 6.5183 5.8797 6.1506 6.3536 6.0559 6.0867 5.9929 6.0792 6.0951 1.0592 1.1052 1.0853 1.0845 1.0845 1.0849 1.0873 1.0876 1.0877 1.0885 1.0921 1.0925 1.0935 1.0944 1.0949 1.0962 1.0955 1.0956 1.1016 1.1015 1.0996 1.1009
irintensity: 0.3019 0.0510 0.3936 0.3116 0.1344 0.3055 0.0129 0.3919 1.7226 2.5631 0.3012 0.5805 1.4339 1.7714 0.6061 2.0869 1.1407 1.3066 2.0489 1.0409 1.7036 0.5141 0.0011 0.5356 0.0255 8.4420 14.6222 2.8360 5.9080 1.5541 37.2958 12.4030 17.3665 4.7119 11.6020 0.1456 0.3721 25.8019 15.7998 65.2463 73.9212 60.7626 29.6833 18.2271 18.7511 28.2375 45.4693 30.2447 24.0461 3.0133 2.2069 1.1641 1.3801 0.4547 2.8734 18.5565 9.3027 2.9539 1.6897 18.0148 0.1822 0.0576 1.3273 0.2272 0.1321 0.1238 1.0339 0.4390 0.1447 0.3175 0.1331 0.1583 8.7710 25.4688 5.2108 4.1329 20.2842 63.6361 12.1166 9.7330 17.0038 26.5787 0.1138 0.0930 0.5989 0.1289 22.8035 26.2186 6.5940 6.0438 6.5932 10.7104 10.3860 5.8862 62.5232 0.4527 9.2720 4.1305 3.2815 11.9488 0.4793 0.3986 1.1843 2.0482 33.2068 10.5351 2.2568 6.2693 12.6013 94.8388 10.3078 32.9866 10.2629 69.0368 1.5826 2.6069 2.7574 1.0524 40.8615 7.9355 2.5386 2.1037 34.1701 7.9178 4.1431 2.5663 1.0526 5.5007 0.3295 2.1902 2.6273 10.7036 21.4347 23.3125 21.3006 13.0448 53.8813 26.0608 26.2240 24.9454 21.5182 23.0447 21.8070 12.4632
temp: 298.150 k
press: 1.00000 atm
elementType: 7 7 6 6 6 6 6 6 6 6 6 6 6 6 6 6 6 6 6 6 6 6 6 6 6 6 6 6 1 1 1 1 1 1 1 1 1 1 1 1 1 1 1 1 1 1 1 1 1 1
symmnumber: 1
zpe: 1055075.8 jmol-1
zpe.correction: 0.401857 hartree
zpe.thermalcorrener: 0.425041 hartree
zpe.thermalcorrenthalpy: 0.425985 hartree
zpe.thermalcorrgfe: 0.346276 hartree
zpe.sumelectzpe: -1111.507467 hartree
zpe.sumelectthermal: -1111.484284 hartree
zpe.sumelectthermalent: -1111.483339 hartree
zpe.sumelectthermalfe: -1111.563049 hartree
dipole: -0.3054 -1.8783 0.5745
dipole: 1.9878
quadrupole: -155.8758 -145.7526 -156.7252
quadrupole: -0.4825 0.9262 4.6293
quadrupole: -3.0912 7.0319 -3.9407 -0.4825 0.9262 4.6293
hfenergy: -1111.9093243 hartree
pointgroup: C01 [X(C26H22N2)]
dipole: 0.2544518 -0.7227383 -0.1565125 debye
polarizability: 333.4362019|-32.3190859|363.519004|8.5880767|-28.3369469|209.0487404 unknown
InChI: InChI=1S/C26H22N2/c1-5-13-22(14-6-1)21-28(25-19-11-4-12-20-25)27-26(23-15-7-2-8-16-23)24-17-9-3-10-18-24/h1-20H,21H2
charge 0 multiplicity 1
50 atoms
N  0.8668 -0.149971 1.210042
N  -0.150003 0.719195 0.821677
C  1.992375 0.618454 1.843865
C  2.821305 1.41482 0.842014
C  1.218158 -1.380217 0.537483
C  -1.33382 0.325663 0.348153
C  -2.229355 1.451993 -0.056409
C  -1.855552 -1.076036 0.255833
C  3.934673 0.825792 0.189964
C  2.472788 2.75377 0.528913
C  1.808759 -2.427381 1.291511
C  1.046028 -1.539392 -0.861718
C  -3.646716 1.325272 -0.012699
C  -2.525369 -1.523383 -0.915462
C  -1.67477 2.694804 -0.477349
C  -1.738513 -1.970408 1.354515
C  4.684565 1.558446 -0.757641
C  3.222362 3.489574 -0.416212
C  2.229164 -3.613527 0.653643
C  1.457493 -2.733386 -1.489641
C  4.330455 2.893319 -1.062779
C  2.053125 -3.775211 -0.740614
C  -4.479499 2.407783 -0.369645
C  -3.051606 -2.830661 -0.993286
C  -2.508245 3.774926 -0.83026
C  -2.278304 -3.271747 1.28306
C  -3.916748 3.638508 -0.780018
C  -2.931538 -3.710607 0.107343
H  2.6250 -0.110118 2.376923
H  1.533042 1.28957 2.587546
H  4.212236 -0.209724 0.422507
H  1.61133 3.211192 1.028684
H  1.918132 -2.317687 2.376525
H  0.607572 -0.728469 -1.451288
H  -4.096006 0.383246 0.318582
H  -2.630226 -0.840994 -1.7665
H  -0.58532 2.787533 -0.52269
H  -1.233074 -1.636639 2.267096
H  5.543927 1.092301 -1.252912
H  2.946444 4.525114 -0.646144
H  2.679982 -4.416415 1.247998
H  1.322063 -2.845518 -2.571286
H  4.914324 3.464312 -1.793731
H  2.371652 -4.699293 -1.23493
H  -5.56837 2.292354 -0.320985
H  -3.555773 -3.160892 -1.908618
H  -2.06233 4.721767 -1.156376
H  -2.186182 -3.945108 2.142617
H  -4.564488 4.476604 -1.061114
H  -3.342146 -4.725035 0.050411
