program: Gaussian 09
title: 000252990
version: EM64L-G09RevD.01
frameworkgroup: C1[X(C13H13ClN4O)]
method: RPBEPBE
basis: SDD
operation: Freq
keyword: #p
keyword: freq=noraman
keyword: PBEPBE/SDD
title: #p freq=noraman PBEPBE/SDD
converged: YES YES NO NO
title: Mulliken charges:
elementType: Cl O N N N N C C C C C C C C C C C C C H H H H H H H H H H H H H
charge: -0.007176 -0.252883 -0.319537 0.050487 -0.409549 0.026538 0.454700 0.324329 0.532439 -0.473222 -0.330938 -0.364447 -0.431177 -0.226433 -0.212714 -0.243911 -0.403024 -0.214669 -0.665517 0.295646 0.271205 0.295317 0.228336 0.227151 0.292711 0.229407 0.233866 0.214468 0.208320 0.229674 0.211840 0.228762
chargesum: 0.00000
title: Mulliken charges with hydrogens summed into heavy atoms:
elementType: Cl O N N N N C C C C C C C C C C C C C
charge: -0.007176 -0.252883 -0.319537 0.050487 -0.116838 0.026538 0.454700 0.324329 0.532439 -0.473222 -0.035292 -0.093241 -0.135860 0.001902 0.014437 -0.014504 0.045310 -0.006349 0.004758
polarizability: 3.73787545e+02 -3.18111923e+00 1.95014596e+02 -3.17506356e+00 -4.32343079e+00 8.64804940e+01
1716.lowfreq: -2.5516 0.0005 0.0015 0.0019 2.9282 4.1811 29.4055 35.9820 47.4456
frequency: 29.2952 35.9703 47.3857 52.0376 76.3489 91.2995 120.9843 141.2421 184.0387 191.4193 218.7153 229.4944 250.0990 268.4549 291.0443 317.0743 348.2445 375.6765 395.6357 405.3286 453.7431 491.1317 514.3758 541.6153 565.3096 613.4716 621.7319 625.1197 651.0788 668.1724 689.1691 715.6466 750.3129 766.0295 778.6988 788.6574 839.1795 874.3558 904.0283 918.9028 919.8752 972.1754 974.3135 987.8583 992.7079 1008.7774 1032.5289 1036.2637 1052.5208 1067.1584 1091.7241 1104.7807 1162.2521 1173.1294 1191.0389 1214.4669 1249.6977 1252.4282 1288.9566 1303.0204 1323.0500 1335.7762 1385.0912 1390.1316 1419.3928 1443.0580 1453.8019 1460.5676 1477.3114 1477.7262 1484.0847 1517.6832 1590.7808 1600.6299 1605.8011 1609.7630 1632.0560 2969.0240 2977.8789 2984.6245 3059.9870 3084.5079 3092.2407 3130.5642 3143.4053 3162.1963 3186.1532 3197.7655 3212.1019 3388.6487
redmass: 3.9982 4.7049 3.9890 6.1005 2.6970 4.7343 4.4371 5.9626 6.2360 2.1191 3.2611 2.2231 6.0001 5.7531 3.3647 7.2445 7.5161 6.1327 4.7554 2.9200 3.9511 5.1376 4.4884 5.0556 7.9240 6.2498 1.4211 5.6224 3.8593 6.3139 1.9785 8.3566 6.1578 2.0384 2.3633 1.7522 1.2525 1.3094 1.4865 1.6009 1.4244 1.7601 2.9948 4.6808 1.4060 5.9894 2.6261 2.7623 3.7275 1.8071 2.3627 2.1448 2.2532 1.0497 1.1440 4.6515 1.2186 4.4563 1.3679 1.3759 1.3292 1.4490 9.5257 1.2024 3.5016 2.3821 1.4960 1.5963 2.1281 1.0807 1.0688 4.0227 6.5422 7.8654 6.4413 7.1853 6.7150 1.0831 1.0663 1.0380 1.0962 1.0987 1.1013 1.0854 1.0910 1.0979 1.0949 1.0919 1.0945 1.0752
irintensity: 0.4377 0.4555 0.1057 2.5713 1.3840 0.3088 1.6625 1.0701 0.3395 5.0112 3.2760 14.6491 1.0887 2.4620 10.9211 3.9069 1.2986 1.6534 5.2443 0.5376 8.4580 2.2418 2.6830 7.5030 7.1365 1.0114 74.2746 3.1369 7.9779 26.8860 44.8333 2.4082 22.5140 77.2381 63.9690 3.4637 2.0913 24.8327 22.0013 12.4694 5.9996 23.1903 31.7893 0.4651 0.4902 8.7876 2.6682 12.8642 10.2819 26.0002 61.7340 133.1184 27.2312 0.0638 3.7259 64.6308 16.7869 37.6152 26.1300 22.2777 1.8659 0.3623 1.0251 6.9822 141.4068 10.1091 48.3482 46.4146 88.0257 33.1459 18.9441 12.4937 20.1842 45.6854 70.6362 88.5259 667.7049 43.6218 24.6087 46.5758 0.9849 51.0589 41.4283 0.1239 21.2057 40.7579 3.9101 1.1798 4.4788 14.6336
temp: 298.150 k
press: 1.00000 atm
elementType: 17 8 7 7 7 7 6 6 6 6 6 6 6 6 6 6 6 6 6 1 1 1 1 1 1 1 1 1 1 1 1 1
symmnumber: 1
zpe: 632298.2 jmol-1
zpe.correction: 0.240830 hartree
zpe.thermalcorrener: 0.258491 hartree
zpe.thermalcorrenthalpy: 0.259435 hartree
zpe.thermalcorrgfe: 0.193260 hartree
zpe.sumelectzpe: -1256.054247 hartree
zpe.sumelectthermal: -1256.036585 hartree
zpe.sumelectthermalent: -1256.035641 hartree
zpe.sumelectthermalfe: -1256.101816 hartree
dipole: 5.5813 -2.3284 -0.4468
dipole: 6.0640
quadrupole: -82.7980 -121.7179 -121.1607
quadrupole: 6.8600 0.5459 -4.4538
quadrupole: 25.7609 -13.1591 -12.6018 6.8600 0.5459 -4.4538
hfenergy: -1256.2950763 hartree
pointgroup: C01 [X(C13H13Cl1N4O1)]
dipole: 2.1963333 -0.9209606 -0.140487 debye
polarizability: 373.8121299|-3.2976392|194.7575587|-1.2866641|-6.865578|86.7129463 unknown
InChI: InChI=1S/C13H13ClN4O/c1-2-8-15-17-11-9-16-18(13(19)12(11)14)10-6-4-3-5-7-10/h3-9,17H,2H2,1H3
charge 0 multiplicity 1
32 atoms
Cl 1.232642 3.257026 0.139898
O  -1.683586 2.394448 0.169489
N  -1.308122 0.046775 -0.081076
N  -0.449363 -1.029649 -0.18466
N  2.836414 0.665921 -0.14525
N  3.668295 -0.442438 -0.265592
C  -2.713838 -0.327735 -0.033901
C  -0.868913 1.436084 0.041604
C  1.461637 0.499963 -0.112322
C  0.577661 1.572314 0.006421
C  -3.735319 0.560741 -0.454966
C  -3.04668 -1.630462 0.418087
C  0.862198 -0.813866 -0.200773
C  -5.081542 0.135381 -0.414336
C  -4.394943 -2.038282 0.452948
C  -5.422022 -1.158356 0.038442
C  5.925774 -1.382869 -0.415943
C  4.962016 -0.231135 -0.292562
C  6.919719 -1.443179 0.773537
H  -3.486161 1.567954 -0.7875
H  -2.247679 -2.309399 0.723516
H  1.499143 -1.694298 -0.293702
H  -5.865663 0.827306 -0.740537
H  -4.642001 -3.04483 0.808036
H  3.212368 1.624246 -0.079803
H  -6.469748 -1.476477 0.069996
H  5.349591 -2.321897 -0.488447
H  6.499718 -1.274868 -1.359169
H  5.397857 0.787249 -0.21491
H  6.384988 -1.605464 1.725861
H  7.500133 -0.505957 0.862389
H  7.636727 -2.271849 0.635224
