program: Gaussian 09
title: 000252987
version: EM64L-G09RevD.01
frameworkgroup: C1[X(C16H15ClN4O)]
method: RPBEPBE
basis: SDD
operation: Freq
keyword: #p
keyword: freq=noraman
keyword: PBEPBE/SDD
title: #p freq=noraman PBEPBE/SDD
converged: YES YES NO NO
title: Mulliken charges:
elementType: Cl O N N N N C C C C C C C C C C C C C C C C H H H H H H H H H H H H H H H
charge: 0.026904 -0.245201 -0.307862 -0.035294 -0.319116 0.047588 0.392617 -0.534586 0.523930 0.180815 -0.353644 -0.774049 -0.473421 -0.450655 -0.776995 0.297571 0.457704 -0.329545 -0.366351 -0.227511 -0.212831 -0.243607 0.229354 0.249636 0.241003 0.236835 0.234673 0.263432 0.295335 0.252819 0.233659 0.234552 0.293293 0.273573 0.228348 0.227456 0.229573
chargesum: 0.00000
title: Mulliken charges with hydrogens summed into heavy atoms:
elementType: Cl O N N N N C C C C C C C C C C C C C C C C
charge: 0.026904 -0.245201 -0.307862 -0.035294 -0.319116 0.047588 0.392617 -0.055596 0.523930 0.180815 -0.112641 -0.039110 -0.473421 -0.155321 -0.055965 0.297571 0.457704 -0.036251 -0.092779 0.000837 0.014624 -0.014033
polarizability: 4.19683544e+02 5.81612946e+00 2.15093111e+02 -5.48229072e+00 -1.51896295e+00 1.17387050e+02
1716.lowfreq: -8.3594 -5.5081 -1.6572 0.0016 0.0020 0.0020 28.0310 28.5997 53.8697
frequency: 28.0063 28.5973 53.8551 61.2702 67.2686 104.8762 108.5246 151.4720 161.3956 174.4333 185.2074 198.6810 209.4283 240.6842 253.0242 293.9959 301.5110 312.9900 334.6988 356.6770 394.9781 406.4907 414.7679 443.3491 486.7550 498.7516 507.2525 547.0063 565.2533 571.8384 593.1907 611.1875 615.7427 647.9362 673.7912 689.1620 713.4589 733.7554 758.9647 764.1024 776.1923 809.5918 838.6202 859.9024 885.5543 897.9214 920.3307 964.3849 972.7712 987.7655 992.5539 1005.4511 1012.5627 1031.6835 1036.5143 1037.7360 1052.4891 1054.2749 1071.2785 1093.2159 1106.0514 1164.6764 1173.1255 1190.6246 1197.1663 1204.2786 1241.4145 1254.6800 1288.9691 1315.1033 1322.8891 1330.6257 1385.6654 1390.0889 1402.3691 1403.1817 1442.3725 1450.1993 1454.9362 1456.4363 1461.3917 1477.1499 1477.9437 1495.2574 1570.5479 1594.6132 1600.6859 1606.2186 1613.5758 1669.7086 2924.8414 2975.0641 2989.7291 3050.2254 3051.9051 3077.4385 3101.0905 3113.7979 3130.9695 3143.9506 3162.5128 3175.7112 3187.7585 3195.8217 3211.2160
redmass: 4.9046 3.9585 5.2517 3.7536 8.8835 6.1335 3.7651 1.1211 3.9505 4.2404 1.5541 4.1687 3.1453 2.3178 5.6567 6.4678 3.3352 5.3960 5.8473 6.0531 4.7791 3.3206 3.4443 5.3415 4.7740 4.4542 4.6773 5.5692 5.7366 5.3877 6.2952 5.8566 6.5854 5.9544 6.7191 1.9782 8.6272 4.9721 1.3166 2.4596 3.5113 5.0339 1.2566 1.3436 3.1969 1.7813 1.4211 2.4315 1.3802 4.4645 1.4256 3.5101 3.0426 2.2619 1.6798 2.1556 2.1679 2.2379 1.8699 2.2435 2.1780 1.6251 1.0498 1.2090 3.0667 2.5014 2.3257 5.4724 1.7024 1.7841 1.3508 2.1369 8.5453 1.5780 3.6641 1.2251 2.3660 1.1120 1.0775 1.0564 1.0532 2.1972 1.0779 9.0070 8.2558 6.6800 9.1769 6.1116 7.1333 7.0689 1.0700 1.0379 1.0378 1.0970 1.0899 1.0968 1.0990 1.0984 1.0854 1.0911 1.0979 1.0939 1.0948 1.0919 1.0946
irintensity: 1.3812 0.1886 1.6474 1.7238 1.2073 0.4356 2.5305 1.5947 1.1998 4.9813 1.1041 0.3236 4.1984 4.9918 0.8084 4.1823 4.6525 9.5769 1.3303 1.7708 3.0418 0.6529 1.7773 3.9322 20.2070 4.3210 6.5728 7.8768 1.6487 1.3446 16.2795 0.7340 1.0252 6.6293 24.8360 45.9864 3.4576 17.6776 28.5341 83.1717 37.0064 7.7898 1.1934 18.3334 4.9241 1.8894 5.7619 63.8748 2.4443 0.1097 0.9497 6.3276 57.5751 1.7014 5.1900 11.4921 10.5636 31.1265 7.1577 4.3623 54.3003 8.7118 0.2277 4.7998 8.5978 34.6443 9.0858 67.5417 28.7048 71.6291 7.9836 12.7650 0.8667 32.3795 161.3554 23.1865 15.3451 17.4716 9.1640 7.6245 10.3115 105.6706 10.6760 0.8215 98.6500 38.1986 334.8256 9.3962 224.1557 20.2821 38.2255 32.1156 19.4612 15.5195 36.0061 9.6373 14.7269 10.6672 0.1335 21.0857 43.4373 7.1701 3.8037 0.6785 3.7711
temp: 298.150 k
press: 1.00000 atm
elementType: 17 8 7 7 7 7 6 6 6 6 6 6 6 6 6 6 6 6 6 6 6 6 1 1 1 1 1 1 1 1 1 1 1 1 1 1 1
symmnumber: 1
zpe: 734501.8 jmol-1
zpe.correction: 0.279757 hartree
zpe.thermalcorrener: 0.299570 hartree
zpe.thermalcorrenthalpy: 0.300514 hartree
zpe.thermalcorrgfe: 0.230425 hartree
zpe.sumelectzpe: -1371.363209 hartree
zpe.sumelectthermal: -1371.343396 hartree
zpe.sumelectthermalent: -1371.342452 hartree
zpe.sumelectthermalfe: -1371.412541 hartree
dipole: 4.8592 2.6081 1.8443
dipole: 5.8151
quadrupole: -101.8151 -135.2125 -136.8728
quadrupole: -0.7169 -2.0994 -8.3296
quadrupole: 22.8184 -10.5790 -12.2394 -0.7169 -2.0994 -8.3296
hfenergy: -1371.6429662 hartree
pointgroup: C01 [X(C16H15Cl1N4O1)]
dipole: -1.9095475 1.1973437 -0.3925865 debye
polarizability: 419.8424716|-3.6682227|204.5048716|-3.0690101|30.3208545|127.8163623 unknown
InChI: InChI=1S/C16H15ClN4O/c1-11-8-9-12(2)20(19-11)14-10-18-21(16(22)15(14)17)13-6-4-3-5-7-13/h3-7,9-10H,8H2,1-2H3
charge 0 multiplicity 1
37 atoms
Cl -1.15188 -2.840554 0.083808
O  1.805432 -2.363137 0.045124
N  -2.454405 0.032196 -0.229738
N  -3.009986 1.150883 0.476376
N  1.756134 0.017816 -0.026944
N  1.052994 1.210996 0.009188
C  -3.248685 -0.643235 -1.21602
C  -5.16146 -0.089198 0.274874
C  -1.051323 -0.048936 -0.129918
C  -4.30827 1.112605 0.680302
C  -4.59959 -0.64993 -1.016296
C  -2.572976 -1.104878 -2.488767
C  -0.331826 -1.241981 -0.068035
C  -0.273975 1.168539 -0.038922
C  -4.949242 2.290929 1.367686
C  1.131087 -1.295653 -0.021385
C  3.199618 0.188065 0.026296
C  4.081861 -0.78623 -0.505706
C  3.716483 1.381331 0.592675
C  5.474188 -0.555874 -0.462066
C  5.108861 1.594417 0.630026
C  5.997381 0.627779 0.104024
H  -6.220377 0.203411 0.17007
H  -5.119443 -0.84066 1.095615
H  -5.269119 -1.009641 -1.8010
H  -1.972114 -0.2918 -2.936965
H  -3.343103 -1.408907 -3.216605
H  -1.905651 -1.96833 -2.327814
H  -0.786922 2.130608 -0.006663
H  -4.190725 3.031608 1.665631
H  -5.504186 1.959933 2.266526
H  -5.682103 2.781004 0.698294
H  3.691585 -1.712845 -0.925727
H  3.023409 2.128876 0.984114
H  6.150009 -1.313118 -0.874117
H  5.498786 2.516789 1.074261
H  7.079534 0.794124 0.137897
