program: Gaussian 09
title: 000252984
version: EM64L-G09RevD.01
frameworkgroup: C1[X(C14H12N4O)]
method: RPBEPBE
basis: SDD
operation: Freq
keyword: #p
keyword: freq=noraman
keyword: PBEPBE/SDD
title: #p freq=noraman PBEPBE/SDD
converged: YES YES NO NO
title: Mulliken charges:
elementType: O N N N N C C C C C C C C C C C C C C H H H H H H H H H H H H
charge: -0.270420 -0.301089 -0.092227 -0.413115 0.055768 0.296958 0.309295 -0.537071 0.192825 0.390301 -0.391433 -0.362087 -0.771291 -0.370446 -0.423398 -0.225055 -0.218702 -0.232473 0.195944 0.275753 0.248406 0.258167 0.247397 0.230795 0.245506 0.299899 0.306011 0.231558 0.234574 0.235244 0.354405
chargesum: 0.00000
title: Mulliken charges with hydrogens summed into heavy atoms:
elementType: O N N N N C C C C C C C C C C C C C C
charge: -0.270420 -0.301089 -0.092227 -0.058710 0.055768 0.296958 0.309295 -0.261318 0.192825 0.390301 -0.143027 -0.103921 -0.047592 -0.070547 -0.117387 0.006503 0.015872 0.002771 0.195944
polarizability: 2.08219113e+02 -1.98197756e-01 2.46245760e+02 1.88260038e+01 2.97312669e+00 1.09471287e+02
1716.lowfreq: -95.5136 -9.7510 -3.3468 -0.0002 0.0004 0.0005 6.2816 36.4807 40.8814
frequency: -95.5136 36.3113 40.8779 60.0744 78.0783 111.1893 123.5128 177.9382 213.3538 237.1539 237.5665 273.1548 341.9382 353.4849 377.2293 404.8442 436.2710 451.3494 497.2670 540.3079 570.0644 612.3316 626.3301 634.1700 654.0568 654.9091 681.1485 703.6201 705.2049 721.3893 758.1659 770.0219 836.9811 854.7984 860.0214 868.3286 873.8500 928.6243 947.6822 979.1128 980.4411 982.1028 988.6214 1000.7959 1009.4649 1023.8493 1044.9704 1047.6583 1080.8829 1090.7748 1109.4904 1175.3852 1188.0115 1193.0369 1227.2827 1258.6611 1295.0601 1308.5972 1325.8097 1370.9916 1377.4672 1396.0643 1402.2283 1413.0438 1437.3909 1450.5854 1464.7795 1483.8788 1488.9942 1510.7011 1556.3480 1580.1720 1584.4684 1614.9350 1650.0164 2994.6752 3077.4815 3104.2694 3130.1966 3135.3719 3146.8294 3155.9625 3170.5589 3204.5894 3212.6028 3231.4965 3529.4242
redmass: 1.0210 6.4393 4.8559 5.2278 4.3033 5.3423 4.7812 4.9541 3.9834 4.3983 5.1087 5.3701 5.8996 4.8317 5.0678 2.8419 5.5001 5.6501 4.2049 7.7983 4.4267 6.4468 4.9150 6.1379 6.4347 4.7185 4.3043 2.0305 2.8310 5.3717 1.3820 1.7689 1.3916 1.3306 3.0114 1.5579 1.5154 1.4067 6.6569 4.2585 1.7451 1.5533 5.6888 1.3298 2.9435 2.6562 1.5042 2.4109 1.6840 3.5376 3.1532 1.0563 1.6657 1.1157 3.7872 3.5040 1.8639 1.7513 1.7640 5.6951 3.1480 2.2769 1.2272 3.0519 2.4788 3.3539 1.0443 1.2220 3.3221 5.4272 6.2952 5.9832 6.2362 6.2071 6.1383 1.0373 1.0982 1.0992 1.0851 1.0878 1.0925 1.0968 1.1018 1.0932 1.0933 1.0990 1.0791
irintensity: 0.3198 0.9014 0.3875 0.4681 0.8322 2.1998 0.4208 3.0809 1.1501 1.8854 3.2048 2.1208 0.8524 12.1183 0.3246 0.0129 3.7839 5.1635 3.4957 5.4772 10.6226 0.1309 2.1548 3.1667 1.4461 2.4046 6.0907 23.7929 28.4133 12.8960 113.0029 63.9879 20.7172 2.8883 8.2072 34.5060 9.5155 4.1780 67.4364 8.5226 4.4830 1.7104 1.0439 0.3603 8.6454 11.3575 7.4053 5.2503 17.0509 31.5106 4.2982 0.0098 9.2941 0.9757 20.5318 0.8817 21.8808 46.4733 40.2979 3.6847 61.5094 10.8766 10.9534 39.7898 45.1560 40.2902 14.9240 6.8871 111.7283 11.3345 22.5016 75.5427 19.2593 2.0787 530.8513 28.5831 13.0635 14.6860 2.4758 0.0438 13.7022 28.6957 16.9106 1.3866 1.4194 0.6852 69.9435
temp: 298.150 k
press: 1.00000 atm
elementType: 8 7 7 7 7 6 6 6 6 6 6 6 6 6 6 6 6 6 6 1 1 1 1 1 1 1 1 1 1 1 1
symmnumber: 1
zpe: 618703.4 jmol-1
zpe.correction: 0.235652 hartree
zpe.thermalcorrener: 0.250644 hartree
zpe.thermalcorrenthalpy: 0.251589 hartree
zpe.thermalcorrgfe: 0.192187 hartree
zpe.sumelectzpe: -833.569380 hartree
zpe.sumelectthermal: -833.554387 hartree
zpe.sumelectthermalent: -833.553443 hartree
zpe.sumelectthermalfe: -833.612845 hartree
dipole: -3.7457 2.1791 1.0385
dipole: 4.4561
quadrupole: -104.5473 -109.6856 -110.3453
quadrupole: 3.7624 6.2298 -7.3865
quadrupole: 3.6454 -1.4928 -2.1525 3.7624 6.2298 -7.3865
hfenergy: -833.8050319 hartree
pointgroup: C01 [X(C14H12N4O1)]
dipole: -1.3183766 1.1336141 -0.2245344 debye
polarizability: 241.0722609|13.9244686|208.8294528|-12.1938216|25.3785324|114.0344456 unknown
InChI: InChI=1S/C14H12N4O/c1-10-7-13(11-5-3-2-4-6-11)18(17-10)12-8-14(19)16-15-9-12/h2-9,16H,1H3
charge 0 multiplicity 1
31 atoms
O  3.74414 -1.596056 0.555249
N  -1.044428 -0.707794 -0.047783
N  -2.256221 -1.433443 0.005072
N  2.305122 -3.113456 -0.494766
N  1.100314 -3.579879 -0.957989
C  -1.252615 0.668635 0.165063
C  -0.237236 1.738126 0.054823
C  -2.63182 0.80962 0.376679
C  -3.20961 -0.49839 0.267148
C  0.151618 -1.46896 -0.160172
C  -0.204734 2.773509 1.027263
C  0.66341 1.79944 -1.044587
C  -4.65418 -0.897083 0.397028
C  1.380497 -1.042605 0.32489
C  0.049357 -2.771328 -0.793587
C  0.714121 3.839119 0.910779
C  1.583771 2.862012 -1.155505
C  1.614923 3.884954 -0.178071
C  2.570212 -1.87356 0.165785
H  -3.159548 1.748577 0.529917
H  -0.88988 2.727615 1.881154
H  0.633625 1.023779 -1.817316
H  -4.790643 -1.636594 1.205936
H  -5.281611 -0.019386 0.622115
H  -5.025944 -1.357347 -0.535707
H  1.519769 -0.092459 0.841988
H  -0.913118 -3.142824 -1.144223
H  0.732414 4.625916 1.672674
H  2.273426 2.894772 -2.005693
H  2.333147 4.707332 -0.264953
H  3.09662 -3.748642 -0.631812
