program: Gaussian 09
title: 000260972
version: EM64L-G09RevD.01
frameworkgroup: C1[X(C15H23NO2S)]
method: RPBEPBE
basis: SDD
operation: Freq
keyword: #p
keyword: freq=noraman
keyword: PBEPBE/SDD
title: #p freq=noraman PBEPBE/SDD
converged: YES YES NO NO
title: Mulliken charges:
elementType: S O O N C C C C C C C C C C C C C C C H H H H H H H H H H H H H H H H H H H H H H H
charge: 0.937240 -0.540497 -0.538192 -0.523684 -0.147923 -0.368100 -0.419564 -0.418581 -0.364836 -0.399248 -0.426310 -0.360422 -0.024984 -0.233617 -0.266149 -0.362964 -0.368868 0.451109 -0.799857 0.237998 0.222545 0.198931 0.272677 0.199630 0.199067 0.203588 0.172784 0.208041 0.200854 0.205664 0.202247 0.200718 0.189994 0.194148 0.306108 0.277893 0.294258 0.242390 0.243074 0.241038 0.231178 0.230620
chargesum: 0.00000
title: Mulliken charges with hydrogens summed into heavy atoms:
elementType: S O O N C C C C C C C C C C C C C C C
charge: 0.937240 -0.540497 -0.538192 -0.217577 0.090075 0.053377 0.052744 -0.015927 0.015989 0.007270 -0.023345 0.023720 -0.024984 0.044277 0.028109 -0.120574 -0.125793 0.451109 -0.097020
polarizability: 2.45262685e+02 -2.35586590e+01 1.84890929e+02 2.34607241e+00 4.59238327e+00 1.71523721e+02
1716.lowfreq: -27.3502 -22.6840 -16.9893 -9.4947 0.0020 0.0023 0.0026 7.6720 16.6094
frequency: -27.2537 -15.3158 11.7646 30.9916 55.0884 84.1477 103.8551 120.6429 156.9296 168.2285 198.6579 209.5886 230.1596 231.1681 234.0933 267.0002 290.2417 305.5175 330.8570 338.4212 379.5388 392.6317 404.5766 407.0593 440.2673 461.0349 491.5975 506.6443 524.8364 543.5492 584.8914 622.2222 706.0643 710.2192 753.7156 770.7070 777.0066 799.5008 801.8342 825.0991 830.1258 840.4662 851.6625 866.8982 880.8737 928.2963 955.4572 960.4092 971.3053 984.8330 986.7877 989.4436 996.4697 1008.5658 1049.1717 1052.8239 1054.7490 1090.7761 1098.8939 1116.4682 1119.2736 1124.0795 1145.2012 1176.7137 1183.4865 1213.5376 1218.1109 1233.8672 1246.7153 1252.4971 1263.5710 1284.5015 1295.6201 1302.1621 1325.5442 1338.6759 1343.3309 1344.9800 1354.3189 1360.6123 1364.4297 1372.0453 1381.5881 1391.3659 1397.6234 1459.2102 1460.6604 1463.3373 1468.3813 1470.0767 1473.8454 1474.0130 1474.1561 1484.9676 1497.8536 1596.0049 1596.4879 2950.4419 2955.4444 2960.8937 2967.6414 2978.7409 2979.3699 2983.5748 2991.5185 3003.8283 3008.3202 3014.5231 3020.2726 3026.4137 3034.3639 3048.2887 3057.4539 3061.9887 3091.6228 3134.8301 3136.5171 3160.0903 3167.6643 3338.6771
redmass: 1.0197 3.7692 4.2324 3.7660 3.5489 4.2930 4.7612 4.7337 4.2709 3.9297 2.2575 3.3954 4.1962 3.2931 3.8489 4.7410 3.7147 3.6275 2.2252 2.6202 3.1392 4.5762 4.2509 2.8899 3.3177 2.1923 2.5446 2.4193 2.9337 1.9898 5.4102 6.9523 2.1233 3.1358 1.6141 2.8064 3.5908 5.3128 2.7263 1.3826 1.9391 1.7872 1.2489 1.7922 2.1837 11.9518 1.6751 1.3257 2.3345 1.3694 1.8280 1.5931 4.4692 2.1497 1.5940 2.3364 2.4518 1.3450 2.2287 1.4485 1.6368 2.4827 1.7931 1.2260 1.1475 1.2206 2.9800 1.2553 1.1950 1.2042 1.2296 1.1276 1.2654 1.3160 1.3429 1.4215 1.3464 1.3466 1.4050 1.2997 1.4051 1.2515 6.0835 2.9794 1.2216 1.0788 1.0828 1.0898 1.0830 1.1042 1.5297 1.0855 1.3982 1.0771 1.0784 6.9922 6.0437 1.0676 1.0604 1.0599 1.0626 1.0642 1.0390 1.0763 1.0703 1.0727 1.0958 1.0965 1.0923 1.0975 1.0992 1.1003 1.0999 1.0947 1.1000 1.0891 1.0895 1.0956 1.0962 1.0740
irintensity: 0.5050 0.8214 0.4030 0.1653 0.6074 1.0495 0.5256 0.9045 0.2208 2.5483 2.0037 3.4960 5.2924 1.6795 5.4757 5.0001 0.4711 1.7309 3.7344 9.4254 0.7583 4.2974 47.3537 4.1495 59.8690 8.5592 9.0787 28.4043 54.2912 11.3722 24.9659 0.2318 3.9013 2.4003 17.5809 33.2928 27.9511 75.5622 10.9486 24.7765 100.2839 6.3638 6.1298 2.7324 1.0075 63.7582 3.3000 0.9444 0.5182 1.2490 4.6518 2.6709 3.4529 10.8109 18.1370 20.2419 17.1078 1.7919 6.5279 9.3647 5.9053 0.4049 9.0235 1.2824 10.4302 10.7176 5.9307 2.6568 14.2409 2.0921 1.5376 4.6867 2.3840 6.4614 0.6749 0.8735 0.2524 1.9840 3.0759 7.1667 3.7589 4.4127 0.6086 9.8628 15.6414 2.3201 6.4873 10.6748 12.4881 16.2959 22.1786 4.9110 13.4508 9.5065 32.3470 0.0880 10.1555 24.2238 37.5323 17.6158 28.1824 37.9243 27.2800 8.8786 6.4464 36.2559 33.3488 29.5081 23.5778 110.2643 108.3712 37.5313 25.9674 20.2248 14.8247 14.9979 7.7358 6.3491 4.7056 15.7467
temp: 298.150 k
press: 1.00000 atm
elementType: 16 8 8 7 6 6 6 6 6 6 6 6 6 6 6 6 6 6 6 1 1 1 1 1 1 1 1 1 1 1 1 1 1 1 1 1 1 1 1 1 1 1
symmnumber: 1
zpe: 925970.3 jmol-1
zpe.correction: 0.352683 hartree
zpe.thermalcorrener: 0.371171 hartree
zpe.thermalcorrenthalpy: 0.372115 hartree
zpe.thermalcorrgfe: 0.305041 hartree
zpe.sumelectzpe: -1187.004056 hartree
zpe.sumelectthermal: -1186.985569 hartree
zpe.sumelectthermalent: -1186.984625 hartree
zpe.sumelectthermalfe: -1187.051699 hartree
dipole: -0.2927 5.9935 -0.4577
dipole: 6.0181
quadrupole: -100.6517 -136.8400 -122.4496
quadrupole: -12.9569 -1.4090 1.9568
quadrupole: 19.3287 -16.8595 -2.4692 -12.9569 -1.4090 1.9568
hfenergy: -1187.3567397 hartree
pointgroup: C01 [X(C15H23N1O2S1)]
dipole: 0.1375 2.3634007 -0.0371357 debye
polarizability: 245.706194|23.0791367|183.4965066|-0.0040819|-5.7767523|172.4746345 unknown
InChI: InChI=1S/C15H23NO2S/c1-13-9-11-15(12-10-13)19(17,18)16-14-7-5-3-2-4-6-8-14/h9-12,14,16H,2-8H2,1H3
charge 0 multiplicity 1
42 atoms
S  0.739656 -1.753279 0.25208
O  0.388447 -2.233939 -1.273592
O  1.028236 -2.840849 1.42998
N  -0.555723 -0.631161 1.001042
C  -1.390205 0.159768 0.031884
C  -1.931284 1.347447 0.871208
C  -2.462273 -0.699639 -0.698078
C  -2.678795 2.459063 0.094039
C  -3.686097 -1.119075 0.167455
C  -4.04158 2.100341 -0.566522
C  -4.986378 -0.308305 -0.080856
C  -4.98915 1.201933 0.281901
C  2.188959 -0.560022 0.105063
C  2.834636 -0.141385 1.279662
C  2.597296 -0.176432 -1.180971
C  3.942232 0.723297 1.146557
C  3.70825 0.690418 -1.286623
C  4.389407 1.156224 -0.131536
C  5.56379 2.109562 -0.256268
H  -0.687454 0.563172 -0.725504
H  -1.061455 1.80089 1.382797
H  -2.585951 0.954975 1.673513
H  -1.942886 -1.591569 -1.09439
H  -2.813985 -0.143255 -1.585426
H  -2.00443 2.882477 -0.678679
H  -2.858436 3.275991 0.82249
H  -3.432638 -1.079303 1.249101
H  -3.918129 -2.181899 -0.03917
H  -3.879574 1.621844 -1.550928
H  -4.55275 3.058637 -0.786707
H  -5.806405 -0.796655 0.485096
H  -5.253545 -0.406191 -1.154142
H  -4.765244 1.329451 1.360973
H  -6.02916 1.561122 0.149404
H  -1.12566 -1.276269 1.586051
H  2.492586 -0.48961 2.258994
H  2.074429 -0.565113 -2.061095
H  4.468708 1.06307 2.045911
H  4.052611 1.002863 -2.279205
H  5.223244 3.161842 -0.202037
H  6.296091 1.96051 0.556205
H  6.088706 1.983653 -1.218881
