program: Gaussian 09
title: 000023773
version: EM64L-G09RevD.01
frameworkgroup: C1[X(C14H16N4O)]
method: RPBEPBE
basis: SDD
operation: Freq
keyword: #p
keyword: freq=noraman
keyword: PBEPBE/SDD
title: #p freq=noraman PBEPBE/SDD
converged: YES YES NO NO
title: Mulliken charges:
elementType: O N N N N C C C C C C C C C C C C C C H H H H H H H H H H H H H H H H
charge: -0.434771 -0.119640 -0.100349 -0.110628 -0.043382 0.446255 -0.576886 -0.576996 -0.371507 -0.324281 -0.280228 -0.358937 0.167032 0.217602 -0.363128 0.171454 -0.277405 -0.767636 -0.345863 0.271608 0.202517 0.256057 0.256133 0.202637 0.271488 0.325552 0.238903 0.281895 0.254632 0.274483 0.252961 0.229992 0.230187 0.256054 0.244195
chargesum: 0.00000
title: Mulliken charges with hydrogens summed into heavy atoms:
elementType: O N N N N C C C C C C C C C C C C C C
charge: -0.434771 -0.119640 -0.100349 -0.110628 -0.043382 0.446255 0.153296 0.153263 -0.045955 -0.085378 0.001668 -0.104305 0.167032 0.217602 -0.088645 0.171454 -0.024444 -0.051404 -0.101668
polarizability: 4.01552669e+02 1.25249739e+01 1.86427006e+02 -3.24107786e-02 -1.21739162e-01 9.59234119e+01
1716.lowfreq: -24.9282 -10.0469 -2.9355 -0.0004 0.0005 0.0007 2.8924 19.4879 32.9933
frequency: -24.7678 17.3491 32.9113 53.7152 55.7731 85.9109 136.7977 145.1958 186.6666 195.3431 220.5936 247.8013 258.6042 281.9878 286.9489 323.4200 358.5254 380.5974 384.3299 414.3023 436.6604 459.8583 465.8507 516.7469 533.1271 543.7027 556.6090 597.0257 606.4198 624.1129 693.7428 730.7696 746.1306 776.0768 822.6021 831.8219 854.2915 858.0313 870.3942 876.9607 901.6713 923.3695 926.1298 965.2032 970.9180 972.3321 998.3842 1000.3881 1015.7025 1051.8167 1052.8675 1071.7143 1086.2072 1106.3094 1122.1287 1150.1098 1158.0909 1161.2110 1188.2564 1214.1762 1257.5515 1278.6791 1286.2543 1304.1539 1358.9671 1381.5756 1392.5551 1395.3314 1398.1500 1409.4765 1416.9687 1432.8650 1440.3828 1451.1865 1452.6693 1463.3595 1466.3629 1471.0606 1471.6375 1559.3563 1570.5991 1579.7537 1604.0725 2986.7256 2998.5381 3005.6978 3065.4845 3119.1002 3119.4271 3125.5700 3136.9748 3140.7163 3147.7947 3154.3267 3159.1088 3166.4050 3166.6624 3172.0121 3174.4504
redmass: 1.0261 3.7505 5.0561 5.2018 3.8608 5.9378 5.2872 5.6296 3.2145 4.0960 1.1546 4.4336 1.4373 2.3608 4.8427 2.7381 3.4146 4.4746 4.6999 3.0023 2.7100 3.6609 3.9569 5.3839 5.1738 5.0191 2.9766 5.5589 3.6970 7.1344 6.6641 3.2405 3.4269 6.3167 4.3687 1.3537 1.3743 5.7296 5.7325 1.7673 1.7601 3.3561 1.3665 1.3820 1.4174 4.9559 2.5516 1.7849 1.3135 1.5922 1.9350 1.2542 1.4327 1.6043 2.5301 1.3014 2.1871 1.5024 2.4637 1.9250 3.2913 1.4054 1.5601 7.0613 7.1434 3.2498 1.4626 1.1472 4.2045 3.9274 1.1852 1.0469 2.0206 1.0549 1.0494 1.6516 1.3222 1.0460 1.1683 7.8059 5.7613 7.0458 7.1368 1.0381 1.0347 1.0339 1.0973 1.0984 1.0980 1.0989 1.0896 1.0888 1.0893 1.1046 1.1045 1.0958 1.0922 1.0945 1.0965
irintensity: 0.4668 1.0319 0.1303 0.0219 4.6098 0.0464 0.4281 3.5320 1.2276 8.2875 0.1457 2.1595 3.8161 5.8665 6.8731 0.4420 8.2112 9.5348 0.4067 0.4538 11.0891 5.3255 0.4655 11.5623 7.3483 5.0587 25.8491 15.0932 20.3669 0.1212 0.1457 4.0724 2.3822 2.8044 6.0117 11.7764 28.2043 2.5670 29.5247 31.1581 15.9926 4.7757 8.6118 1.6315 2.3736 1.0387 19.8789 8.5097 1.4134 10.0502 7.7929 3.7106 5.2027 24.5614 4.5954 17.5583 0.1358 9.6715 47.5875 21.4251 24.0171 2.9788 6.5833 4.1851 40.4756 15.4731 20.7877 7.1124 19.1012 10.1007 5.9064 4.1657 39.0039 16.0986 13.9352 0.7276 30.9955 16.0058 47.2878 46.1900 69.9181 0.4064 41.3070 18.7266 13.8221 46.8201 18.5574 10.5956 0.4520 23.0454 26.4110 8.9567 21.4871 2.2039 27.0436 8.3515 3.7755 0.6695 11.9472
temp: 298.150 k
press: 1.00000 atm
elementType: 8 7 7 7 7 6 6 6 6 6 6 6 6 6 6 6 6 6 6 1 1 1 1 1 1 1 1 1 1 1 1 1 1 1 1
symmnumber: 1
zpe: 724857.2 jmol-1
zpe.correction: 0.276084 hartree
zpe.thermalcorrener: 0.293266 hartree
zpe.thermalcorrenthalpy: 0.294210 hartree
zpe.thermalcorrgfe: 0.229542 hartree
zpe.sumelectzpe: -835.808223 hartree
zpe.sumelectthermal: -835.791041 hartree
zpe.sumelectthermalent: -835.790096 hartree
zpe.sumelectthermalfe: -835.854764 hartree
dipole: 1.8641 4.6847 -0.0161
dipole: 5.0419
quadrupole: -124.0340 -104.0014 -112.2241
quadrupole: 21.6091 -0.1255 0.0266
quadrupole: -10.6142 9.4185 1.1957 21.6091 -0.1255 0.0266
hfenergy: -836.0843065 hartree
pointgroup: C01 [X(C14H16N4O1)]
dipole: 0.7009783 -1.8556543 0.0065382 debye
polarizability: 400.9449862|-16.3255987|186.9300134|-5.4804066|-0.4645151|96.0280872 unknown
InChI: InChI=1S/C14H16N4O/c1-11-10-13(8-9-15-11)17-16-12-4-6-14(7-5-12)18(2,3)19/h4-10H,1-3H3
charge 0 multiplicity 1
35 atoms
O  5.380925 1.289303 -0.141828
N  4.948669 -0.069325 -0.117275
N  -0.804674 -0.394178 -0.000434
N  -1.475317 0.727774 0.000111
N  -5.739479 0.467234 0.07834
C  3.420023 -0.181526 -0.085899
C  5.523585 -0.731903 1.136155
C  5.473492 -0.762002 -1.376348
C  2.710832 1.035328 -0.08989
C  2.76342 -1.430824 -0.054371
C  1.305521 1.011473 -0.062096
C  1.354659 -1.452113 -0.026507
C  0.619871 -0.236277 -0.030209
C  -2.903061 0.559872 0.027665
C  -3.585108 -0.684286 0.043967
C  -5.000403 -0.694479 0.068994
C  -3.660804 1.757915 0.036855
C  -5.778471 -1.994366 0.086691
C  -5.067069 1.656484 0.062625
H  5.120062 -0.179622 1.996206
H  5.26437 -1.803572 1.199339
H  6.612549 -0.58864 1.084953
H  6.563416 -0.616816 -1.372899
H  5.213441 -1.835019 -1.402462
H  5.034576 -0.231439 -2.232726
H  3.319073 1.946216 -0.114505
H  3.318989 -2.374543 -0.051505
H  0.719042 1.934895 -0.064441
H  0.799315 -2.395011 -0.001548
H  -3.011198 -1.615232 0.03656
H  -3.150456 2.725055 0.024063
H  -5.549793 -2.610144 -0.802915
H  -5.527082 -2.599555 0.977517
H  -6.857245 -1.776179 0.099473
H  -5.692568 2.5561 0.07054
