program: Gaussian 09
title: 000023739
version: EM64L-G09RevD.01
frameworkgroup: C1[X(C11H14O2)]
method: RPBEPBE
basis: SDD
operation: Freq
keyword: #pfreq=noraman
keyword: PBEPBE/SDD
title: #p freq=noraman PBEPBE/SDD
converged: YES YES NO NO
title: Mulliken charges:
elementType: O O C C C C C C C C C C C H H H H H H H H H H H H H H
charge: -0.413149 -0.239173 -0.032875 -0.584297 -0.512497 -0.725597 0.492944 -0.394687 -0.435524 0.172830 -0.232147 -0.228181 -0.244211 0.246993 0.233375 0.199743 0.257318 0.250840 0.200146 0.245332 0.212857 0.251111 0.230091 0.223445 0.222424 0.226334 0.376555
chargesum: 0.00000
title: Mulliken charges with hydrogens summed into heavy atoms:
elementType: O O C C C C C C C C C C C
charge: -0.036594 -0.239173 0.214118 -0.151179 -0.004338 -0.067262 0.492944 -0.143577 -0.205432 0.172830 -0.008702 -0.005758 -0.017876
polarizability: 1.58844423e+02 2.07555711e+00 1.16681299e+02 -7.14166692e+00 -1.44810314e+01 8.24915291e+01
1716.lowfreq: -8.2279 0.0002 0.0005 0.0006 5.5673 8.4538 29.9053 34.0621 49.4536
frequency: 29.7077 34.0239 48.8163 90.1159 96.2816 154.4927 224.4436 241.3426 273.1256 327.6513 340.0151 403.7847 406.6522 455.0721 485.8493 513.5647 579.7512 609.4245 618.0260 644.8646 708.4037 747.5024 805.6613 838.3646 853.7254 857.6036 886.5997 903.7216 924.5914 962.4755 978.6798 989.5287 994.5805 1027.1060 1036.7492 1058.7323 1090.6630 1101.9581 1158.1890 1170.8197 1175.9395 1187.7880 1215.1863 1232.8443 1245.2292 1288.3790 1319.1568 1325.9442 1342.1123 1363.7326 1383.3154 1390.5711 1430.0651 1441.4808 1467.5118 1476.4588 1482.6185 1483.6215 1592.5603 1614.4545 1661.1076 2970.5629 2976.2206 2985.4530 3000.7301 3037.3394 3042.4765 3062.9707 3082.7747 3113.5632 3115.5149 3130.4506 3141.7316 3160.5972 3508.4465
redmass: 5.4285 6.8868 4.1141 3.3114 3.6954 3.4710 1.4413 1.9390 3.8064 2.9682 2.4694 2.1934 2.8332 3.8984 2.4282 2.3237 4.2517 4.2648 6.1719 1.3845 1.8296 1.9330 2.9449 2.6131 3.1405 1.2759 1.5757 1.7266 1.4944 1.8450 1.3821 6.0519 1.3168 2.1863 1.9579 1.7646 2.4679 1.5936 2.1762 1.0648 1.2174 1.1197 2.2986 1.4103 1.4550 1.3994 1.4664 1.3869 1.3416 1.8162 6.8239 1.2246 1.0943 2.1379 1.1024 1.0784 1.0537 2.2143 6.0503 6.1293 8.1106 1.0376 1.0605 1.0620 1.0825 1.1015 1.0974 1.0984 1.0987 1.0862 1.0874 1.0910 1.0959 1.1014 1.0639
irintensity: 0.7326 0.4722 0.2270 0.3510 0.7408 1.9580 0.1695 1.3388 1.2585 3.0009 2.3561 1.3828 0.0457 20.9166 2.3354 38.3784 13.4768 10.3173 0.6888 128.0652 48.7534 57.3663 3.9338 4.2592 0.8189 0.3536 5.3289 17.6488 6.2001 28.9756 0.0625 0.0171 0.2522 9.8446 196.9830 79.7576 6.1151 16.8677 32.8792 0.3829 6.2994 0.4127 0.9018 7.0670 0.6600 19.7883 8.6064 11.1196 3.6990 44.2848 1.3384 13.0402 33.7146 5.7464 4.3991 11.0934 10.9320 17.5120 1.7580 9.3109 192.7101 30.0010 23.4968 17.9828 9.7997 15.2126 6.6657 50.6711 32.2512 9.3642 2.5673 11.2704 43.7741 25.9670 22.0803
temp: 298.150 k
press: 1.00000 atm
elementType: 8 8 6 6 6 6 6 6 6 6 6 6 6 1 1 1 1 1 1 1 1 1 1 1 1 1 1
symmnumber: 1
zpe: 586897.3 jmol-1
zpe.correction: 0.223537 hartree
zpe.thermalcorrener: 0.236420 hartree
zpe.thermalcorrenthalpy: 0.237364 hartree
zpe.thermalcorrgfe: 0.182385 hartree
zpe.sumelectzpe: -577.057049 hartree
zpe.sumelectthermal: -577.044166 hartree
zpe.sumelectthermalent: -577.043222 hartree
zpe.sumelectthermalfe: -577.098201 hartree
dipole: 0.9602 1.2545 -0.1292
dipole: 1.5850
quadrupole: -69.0746 -76.5056 -78.5395
quadrupole: -1.8502 -1.3879 -1.2743
quadrupole: 5.6320 -1.7990 -3.8329 -1.8502 -1.3879 -1.2743
hfenergy: -577.2805861 hartree
pointgroup: C01 [X(C11H14O2)]
dipole: -0.389036 -0.4828541 -0.0661259 debye
polarizability: 158.5648872|0.5594655|116.1860339|9.1528012|14.7898394|83.2663304 unknown
InChI: InChI=1S/C11H14O2/c1-9(8-11(12)13)7-10-5-3-2-4-6-10/h2-6,9,12H,7-8H2,1H3
charge 0 multiplicity 1
27 atoms
O  -4.493469 0.556807 -0.683642
O  -2.658908 1.677299 0.185901
C  -1.14778 -0.830219 0.419146
C  -0.287208 -0.394363 -0.808355
C  -2.653325 -0.804879 0.070121
C  -0.737697 -2.228622 0.931134
C  1.160811 -0.095382 -0.447004
C  1.476876 1.073198 0.296951
C  2.218212 -0.962034 -0.822878
C  -3.208334 0.594706 -0.118616
C  2.810859 1.364399 0.65626
C  3.55637 -0.674447 -0.465035
C  3.857357 0.489906 0.277474
H  -0.976263 -0.089706 1.224938
H  -0.74303 0.513556 -1.247956
H  -0.334175 -1.193556 -1.574948
H  -3.245292 -1.278101 0.879839
H  -2.869244 -1.393492 -0.842175
H  -0.947836 -3.006636 0.171194
H  0.342443 -2.260063 1.157294
H  -1.287353 -2.496866 1.852716
H  0.669421 1.759115 0.583658
H  1.992685 -1.865739 -1.403246
H  3.036509 2.273372 1.225893
H  4.360543 -1.355413 -0.767066
H  4.893378 0.716284 0.553959
H  -4.839849 1.487076 -0.767756
