program: Gaussian 09
title: 000260966
version: EM64L-G09RevD.01
frameworkgroup: C1[X(C14H22O)]
method: RPBEPBE
basis: SDD
operation: Freq
keyword: #pfreq=noraman
keyword: PBEPBE/SDD
title: #p freq=noraman PBEPBE/SDD
converged: YES YES NO NO
title: Mulliken charges:
elementType: O C C C C C C C C C C C C C C H H H H H H H H H H H H H H H H H H H H H H
charge: -0.445778 -0.229544 -0.405727 -0.363437 -0.346319 0.574359 -0.729688 -0.358151 -0.521109 -0.461665 0.308740 -0.697266 -0.387252 0.110604 -0.822664 0.202029 0.192330 0.194988 0.179247 0.213136 0.186465 0.183865 0.226600 0.211828 0.211248 0.197446 0.193716 0.232010 0.232649 0.214591 0.209927 0.208927 0.212350 0.225404 0.267623 0.224755 0.353764
chargesum: 0.00000
title: Mulliken charges with hydrogens summed into heavy atoms:
elementType: O C C C C C C C C C C C C C C
charge: -0.092015 -0.027515 -0.018408 0.028946 0.024010 0.574359 -0.080013 0.033011 -0.289099 -0.229016 0.308740 -0.063822 -0.174901 0.110604 -0.104882
polarizability: 1.66994889e+02 2.48946872e+01 1.46116670e+02 2.00375618e+00 7.34229168e-01 1.49444983e+02
1716.lowfreq: -96.0982 -0.0009 -0.0005 -0.0004 5.4776 9.1798 22.9162 26.6580 31.5198
frequency: -96.0828 26.4852 30.3367 40.4828 82.7193 102.4872 119.3317 132.3816 167.1019 176.6361 203.5925 222.4050 229.6570 245.6935 296.2743 301.9680 323.4565 342.2744 399.1718 424.5767 438.5873 476.5378 481.0791 516.1922 569.6086 606.9703 680.3302 722.6757 732.8296 744.6664 756.0327 802.9362 837.5163 870.7467 897.4786 901.3610 922.6975 928.8133 947.7296 985.4706 999.9673 1016.3213 1047.6493 1051.5808 1068.4675 1079.5375 1085.5436 1099.0182 1121.1205 1137.2056 1162.9736 1174.8142 1199.6180 1227.7992 1239.6228 1253.2903 1256.4602 1283.8329 1286.3949 1290.2666 1293.9678 1318.8896 1342.7937 1347.8210 1355.2042 1383.2347 1385.8928 1390.5572 1395.4779 1421.0612 1458.9165 1463.2154 1469.5189 1470.3573 1472.6599 1476.5318 1476.7652 1479.9276 1483.8915 1487.2656 1500.3706 1610.2015 1617.0679 2950.0825 2954.1395 2959.4484 2965.8838 2968.4468 2970.8099 2972.2243 2981.9393 2989.6175 3003.2218 3019.4020 3038.8521 3054.9552 3066.3363 3067.5449 3069.5807 3075.4160 3103.7931 3108.9946 3115.7830 3133.9757 3586.0542
redmass: 1.0216 3.5984 3.0709 1.8492 2.8858 3.3956 1.9974 2.7900 3.1983 2.3992 2.2141 1.3223 1.1218 2.5380 3.6819 3.2918 3.5032 1.1437 3.7105 3.4729 2.7806 3.6491 3.1599 3.5048 3.6681 2.9797 3.7095 1.1173 2.7194 3.1597 1.3938 1.4559 1.2719 2.2745 1.8804 1.5516 1.8652 1.3902 1.3146 1.8466 2.8139 1.4177 1.5085 2.3829 2.1352 1.8284 2.2730 1.9335 2.3336 2.0246 1.3506 1.5662 1.5612 1.8134 1.4888 1.7497 1.7860 1.3033 1.0711 1.2362 1.2010 1.3474 1.6759 1.5825 1.6625 1.3060 1.2222 3.9151 1.2169 2.6914 1.0749 1.0701 1.0722 1.1329 1.0511 1.0445 1.0764 1.0811 1.0466 1.0887 2.6887 6.1939 6.6403 1.0589 1.0603 1.0646 1.0738 1.0632 1.0374 1.0355 1.0390 1.0957 1.0990 1.1034 1.1040 1.0977 1.0995 1.1006 1.0993 1.0998 1.0876 1.0905 1.0964 1.0960 1.0659
irintensity: 0.0007 0.0738 0.2398 0.0443 0.1085 0.1605 0.0563 0.0672 1.1347 1.8236 2.2849 0.8764 0.0167 1.8534 5.1619 7.1176 0.7596 128.3365 0.8261 1.8352 8.8140 5.1833 0.5346 1.3752 5.2321 12.3779 10.3574 9.0437 2.6779 8.1854 4.0361 41.6804 1.8352 5.2495 5.7916 12.6350 0.7463 0.0737 1.0752 7.4804 1.1508 0.3984 6.8705 3.7848 6.6918 75.9602 18.2167 108.0884 8.3174 6.1828 18.0146 20.7426 0.5410 1.6856 18.8676 24.8463 21.5464 5.4919 5.0042 4.6430 27.3206 1.0020 0.2537 2.6711 1.3397 13.9231 11.3177 7.0801 17.6565 12.9420 0.6750 0.1487 2.9468 6.5014 10.6687 9.9828 2.5687 3.4690 14.9753 17.9359 86.8829 3.6671 7.2572 3.8888 3.1771 13.9460 4.9074 125.5532 35.4100 47.7992 32.7080 5.4882 9.3059 0.3078 98.2330 22.5460 37.5029 119.3168 53.2826 36.5137 23.1171 13.4384 9.0963 16.9601 32.1902
temp: 298.150 k
press: 1.00000 atm
elementType: 8 6 6 6 6 6 6 6 6 6 6 6 6 6 6 1 1 1 1 1 1 1 1 1 1 1 1 1 1 1 1 1 1 1 1 1 1
symmnumber: 1
zpe: 849509.3 jmol-1
zpe.correction: 0.323561 hartree
zpe.thermalcorrener: 0.340276 hartree
zpe.thermalcorrenthalpy: 0.341220 hartree
zpe.thermalcorrgfe: 0.277994 hartree
zpe.sumelectzpe: -620.745534 hartree
zpe.sumelectthermal: -620.728818 hartree
zpe.sumelectthermalent: -620.727874 hartree
zpe.sumelectthermalfe: -620.791101 hartree
dipole: 0.1850 0.2077 -1.2081
dipole: 1.2397
quadrupole: -94.5798 -93.7615 -85.4841
quadrupole: 3.7390 5.6033 2.7947
quadrupole: -3.3046 -2.4864 5.7911 3.7390 5.6033 2.7947
hfenergy: -621.0690947 hartree
pointgroup: C01 [X(C14H22O1)]
dipole: 0.0671893 -0.0850319 0.4755413 debye
polarizability: 166.5969926|-25.0692709|146.5482936|-1.9619242|0.4783705|149.411256 unknown
InChI: InChI=1S/C14H22O/c1-4-5-6-7-11(2)13-8-9-14(15)12(3)10-13/h8-11,15H,4-7H2,1-3H3
charge 0 multiplicity 1
37 atoms
O  -3.839312 2.03406 0.406126
C  0.31502 -1.993561 0.244397
C  1.623165 -1.465936 -0.415295
C  2.293571 -0.310406 0.359539
C  3.586729 0.203889 -0.312549
C  -0.780636 -0.925078 0.304037
C  -0.183226 -3.274427 -0.476633
C  4.258749 1.357337 0.467005
C  -1.308915 -0.344208 -0.877706
C  -1.306146 -0.489262 1.544267
C  -2.324499 0.640329 -0.864535
C  5.542721 1.879521 -0.213476
C  -2.321139 0.490598 1.598262
C  -2.824097 1.049851 0.401093
C  -2.864153 1.238629 -2.151544
H  0.564809 -2.272259 1.289785
H  2.338109 -2.310152 -0.504996
H  1.40117 -1.135086 -1.451276
H  2.527627 -0.649704 1.391056
H  1.5757 0.527624 0.463015
H  3.352443 0.547462 -1.342168
H  4.308456 -0.633119 -0.421451
H  -1.093133 -3.675583 0.005042
H  -0.428692 -3.064309 -1.534608
H  0.594654 -4.060847 -0.460532
H  3.533226 2.188581 0.57994
H  4.496919 1.012117 1.494047
H  -0.92094 -0.663204 -1.854366
H  -0.919313 -0.916975 2.477066
H  6.001719 2.703951 0.362907
H  5.325425 2.257965 -1.230306
H  6.295917 1.074602 -0.310387
H  -2.717727 0.818031 2.569032
H  -3.294847 0.454878 -2.802604
H  -3.648364 1.982159 -1.944073
H  -2.060121 1.736289 -2.725655
H  -4.111868 2.241644 1.333846
