program: Gaussian 09
title: 000252959
version: EM64L-G09RevD.01
frameworkgroup: C1[X(C5H4ClN5)]
method: RPBEPBE
basis: SDD
operation: Freq
keyword: #p
keyword: freq=noraman
keyword: PBEPBE/SDD
title: #p freq=noraman PBEPBE/SDD
converged: NO NO NO NO
title: Mulliken charges:
elementType: Cl N N N N N C C C C C H H H H
charge: -0.001406 -0.286001 0.025530 -0.147027 -0.637519 -0.092720 0.194540 0.356216 -0.271204 -0.187457 -0.201222 0.267191 0.289047 0.329214 0.362818
chargesum: 0.00000
title: Mulliken charges with hydrogens summed into heavy atoms:
elementType: Cl N N N N N C C C C C
charge: -0.001406 -0.286001 0.025530 -0.147027 0.054513 -0.092720 0.194540 0.356216 -0.004013 0.101589 -0.201222
polarizability: 1.42810927e+02 1.20617819e+00 1.14467043e+02 -5.01019249e-03 -8.02075955e-03 3.86821222e+01
1716.lowfreq: -9.7731 -6.1202 -0.0028 -0.0010 -0.0007 9.9036 120.4522 181.8617 198.1282
frequency: 120.4475 181.8613 198.1230 221.4605 254.0408 349.9946 358.5460 481.3344 493.8668 537.2743 565.0807 595.0647 604.8770 622.7580 650.0465 718.7279 738.9966 781.9760 810.4734 896.4563 919.6886 960.1521 1034.4241 1093.5448 1136.3186 1155.9385 1260.0871 1295.4642 1336.2909 1360.8913 1385.4635 1446.8573 1571.8693 1588.3185 1639.1568 3185.8905 3276.3416 3528.4654 3680.1381
redmass: 14.3913 5.0979 4.6586 8.5609 3.9432 7.9210 20.6269 1.1568 6.7796 5.7604 1.4870 4.0264 2.9889 5.2892 5.3222 10.4228 3.9210 1.5987 1.5637 8.4525 6.9400 8.5859 1.8457 2.4566 1.7365 3.1725 6.1113 7.0570 3.0919 3.9367 4.1445 11.1335 4.5133 4.0940 1.5183 1.0935 1.1008 1.0464 1.1042
irintensity: 2.1604 8.3257 4.7732 0.7165 10.8711 0.2739 2.7334 111.1453 1.2763 11.1819 95.9859 57.2020 41.4598 2.5682 5.7370 17.2676 8.7300 15.7937 58.5497 56.4669 7.9894 6.6654 30.5720 37.4976 14.4518 5.6499 21.8596 12.3050 4.1126 49.4736 37.1067 58.9281 153.8703 71.8459 379.6977 2.3076 3.7633 140.3052 51.1617
temp: 298.150 k
press: 1.00000 atm
elementType: 17 7 7 7 7 7 6 6 6 6 6 1 1 1 1
symmnumber: 1
zpe: 257416.7 jmol-1
zpe.correction: 0.098045 hartree
zpe.thermalcorrener: 0.106573 hartree
zpe.thermalcorrenthalpy: 0.107517 hartree
zpe.thermalcorrgfe: 0.064152 hartree
zpe.sumelectzpe: -925.921394 hartree
zpe.sumelectthermal: -925.912866 hartree
zpe.sumelectthermalent: -925.911922 hartree
zpe.sumelectthermalfe: -925.955287 hartree
dipole: 1.8770 4.5359 0.0004
dipole: 4.9089
quadrupole: -88.3302 -52.4960 -71.7439
quadrupole: -1.1602 -0.0018 -0.0024
quadrupole: -17.4735 18.3607 -0.8872 -1.1602 -0.0018 -0.0024
hfenergy: -926.0194391 hartree
pointgroup: C01 [X(C5H4Cl1N5)]
dipole: -0.9964091 1.6544362 -0.0001378 debye
dipolederiv: -0.7930937 -0.1464502 0.0001106 -0.195299 -0.1538452 0.0000264 0.0002469 0.0000349 -0.0620126 -0.0949547 -0.0175955 -0.0000757 -0.3989856 0.0884223 0.0000224 0.0000215 0.0000322 0.0576599 -0.5567661 0.0817723 0.0001566 0.3626115 -0.5949083 -0.0001266 0.0000291 0.0000198 -0.1109678 -0.4329613 0.1526331 0.0000202 -0.1117468 -0.2538959 -0.000069 -0.000048 0.0000645 -0.228738 -0.3492403 -0.401057 -0.0000546 -0.4150609 -1.3779326 -0.0000546 -0.00012 -0.0001343 -0.6530609 -0.176512 -0.0232077 0.0001471 0.0965851 -0.0469206 0.0000401 0.0000652 -0.0000239 -0.2423819 0.2681066 0.1748917 -0.0000631 0.3533334 -0.3920813 -0.0000702 0.0000279 -0.0000271 0.0822054 0.5943046 0.5827081 0.000071 0.3079046 1.5317048 0.000126 0.0000428 0.0000843 0.2154937 -0.619631 -0.6267307 -0.0000321 -0.1439834 -0.614419 -0.0000086 0.0000581 -0.0000056 -0.2272789 0.1280867 -0.0572623 -0.0000346 -0.0622975 0.1592846 0.0000885 -0.0000042 -0.0001005 -0.039808 1.496018 0.2010646 -0.0002743 0.1047034 1.0074414 0.0001115 -0.0003634 0.000014 0.0311774 0.0440908 0.0573091 0.0000129 0.0600422 0.0169506 -0.0000336 0.0000515 -0.0000341 0.2018293 0.1217026 -0.0440019 -0.0000165 -0.019637 0.0777964 -0.000029 -0.0000416 0.0000437 0.2091064 0.1280453 -0.0367796 0.0000095 0.0236299 0.2860924 -0.000008 0.000007 0.0000167 0.3853405 0.2428045 0.102706 0.0000229 0.0382002 0.2663104 -0.0000152 0.0000275 0.0000151 0.3814356 unknown
polarizability: 142.5361071|3.0280048|114.7418635|-0.0061505|0.0071837|38.6821222 unknown
InChI: InChI=1S/C5H4ClN5/c6-4-1-3(7)5-9-8-2-11(5)10-4/h1-2H,7H2
charge 0 multiplicity 1
15 atoms
Cl -3.530502 -0.905289 0.00017
N  0.402048 -0.920349 -0.000286
N  -0.909025 -1.394167 -0.000328
N  2.172279 0.500085 -0.000246
N  0.234922 2.758815 0.000028
N  2.647801 -0.835074 -0.000054
C  0.8145 0.424902 -0.000237
C  -0.187616 1.456494 -0.000109
C  -1.529395 1.018336 -0.000105
C  1.572073 -1.663947 -0.000585
C  -1.790241 -0.384125 -0.000307
H  -2.362411 1.72381 0.000097
H  1.596383 -2.748306 -0.000777
H  -0.423717 3.533387 0.000113
H  1.2378 2.947426 -0.000075
