program: Gaussian 09
title: 000252954
version: EM64L-G09RevD.01
frameworkgroup: C1[X(C34H24O2)]
method: RPBEPBE
basis: SDD
operation: Freq
keyword: #pfreq=noraman
keyword: PBEPBE/SDD
title: #p freq=noraman PBEPBE/SDD
converged: YES YES NO NO
title: Mulliken charges:
elementType: O O C C C C C C C C C C C C C C C C C C C C C C C C C C C C C C C C C C H H H H H H H H H H H H H H H H H H H H H H H H
charge: -0.134901 -0.173492 -0.338919 -0.299697 -0.500709 -0.452465 0.100728 0.248009 0.188686 0.243176 -0.065890 0.024496 0.286718 0.292184 0.298628 0.329721 -0.382941 -0.408070 -0.408125 -0.407481 -0.398443 -0.361868 -0.368535 -0.392909 -0.236225 -0.246148 -0.228240 -0.236832 -0.240782 -0.230433 -0.248253 -0.247413 -0.244467 -0.232215 -0.243995 -0.244567 0.268645 0.298118 0.316603 0.306219 0.261962 0.238314 0.259521 0.236722 0.231385 0.270025 0.263775 0.250496 0.230305 0.225615 0.229521 0.228891 0.230291 0.234808 0.231641 0.231684 0.227500 0.226418 0.234376 0.228836
chargesum: 0.00000
title: Mulliken charges with hydrogens summed into heavy atoms:
elementType: O O C C C C C C C C C C C C C C C C C C C C C C C C C C C C C C C C C C
charge: -0.134901 -0.173492 -0.070274 -0.001579 -0.184106 -0.146246 0.100728 0.248009 0.188686 0.243176 -0.065890 0.024496 0.286718 0.292184 0.298628 0.329721 -0.120979 -0.169756 -0.148604 -0.170759 -0.167058 -0.091843 -0.104760 -0.142413 -0.005920 -0.020533 0.001281 -0.007941 -0.010491 0.004375 -0.016613 -0.015729 -0.016967 -0.005797 -0.009619 -0.015731
polarizability: 4.80441951e+02 1.16895075e+00 4.67675814e+02 3.35277339e+01 -2.94604087e+01 2.25896899e+02
1716.lowfreq: -0.0006 0.0002 0.0004 1.6238 5.0554 7.5043 19.8542 26.3419 34.7214
frequency: 19.8007 26.2568 34.6862 38.5662 40.5814 45.8228 51.4148 58.2748 60.7446 73.2608 81.6580 98.0824 115.2071 128.9505 167.3626 172.8302 193.6703 199.5510 208.0620 225.9035 255.8115 265.5052 275.3784 319.3297 353.3893 386.0459 399.1774 400.8754 403.7482 404.5225 407.6338 414.2078 453.7676 468.3416 486.2825 513.5358 525.2899 555.0196 568.6787 587.7664 607.5372 613.5401 615.2536 616.2047 617.1439 628.4065 637.0954 669.0461 675.7904 694.5110 697.7308 698.3297 699.5186 700.8422 715.1353 725.8108 759.2744 769.7065 772.1329 787.2489 790.4651 808.2365 841.4833 848.7174 849.6268 850.4653 853.4958 853.9515 887.6450 888.6387 921.2730 922.3006 923.7154 927.6216 942.4562 966.8365 975.1856 976.7452 978.3260 979.3630 984.6390 988.0770 988.4988 989.1307 992.5498 995.1343 995.5458 997.3760 999.5421 1020.4426 1022.7115 1028.0996 1029.2360 1033.1542 1048.5275 1054.1227 1075.8787 1083.3071 1083.9568 1092.6369 1100.1850 1111.9729 1153.3685 1157.9740 1173.4235 1173.6400 1173.7691 1175.2825 1188.5973 1191.9191 1194.9575 1196.1393 1196.5105 1206.1966 1221.7183 1229.3146 1234.3992 1239.0154 1265.1477 1277.2438 1316.8774 1317.8448 1320.1421 1320.6785 1344.0497 1351.6524 1372.0965 1372.9995 1373.8872 1374.5947 1432.3091 1433.9921 1435.3711 1436.4832 1474.1499 1475.8971 1487.5222 1489.6898 1570.1661 1572.3764 1578.6658 1579.9541 1588.0367 1591.2468 1604.8872 1607.1834 1610.6028 1613.3466 1618.8899 1714.7917 3019.4340 3053.2847 3120.4405 3122.0870 3123.3098 3124.2789 3125.3801 3126.1942 3130.8781 3131.4711 3134.2444 3134.6204 3143.1656 3144.2230 3145.6932 3147.4959 3152.9183 3157.2086 3158.7616 3160.3884 3166.8786 3168.9548 3171.1696 3176.4051
redmass: 5.5990 5.4739 4.8101 4.2072 4.3165 5.3409 4.6696 6.0096 5.0341 4.3288 4.8420 10.2966 6.7588 5.4138 5.6260 5.7852 5.5087 5.1142 4.9279 5.8237 6.8078 4.8407 4.9259 6.3652 6.3310 6.0087 2.9080 2.8596 2.8270 2.8764 4.8968 5.4312 4.3323 4.5009 3.8058 4.8851 4.4553 6.3325 3.7578 4.8781 6.6777 6.3255 6.3892 6.4228 6.3369 6.5904 6.9465 5.3461 5.8481 4.0910 1.9083 1.8025 1.8435 1.7248 4.5277 2.6106 3.0787 1.9403 2.3200 2.9819 2.7591 5.0114 3.2247 1.2753 1.2541 2.1663 1.2913 1.8612 4.8891 6.6309 1.4280 1.4632 1.4481 1.4419 3.4485 3.5221 1.3991 1.3931 1.3877 1.4218 5.1400 6.0688 5.6545 5.7333 5.0776 1.3342 1.3229 1.3417 1.3294 2.7676 2.8592 2.4552 2.1899 1.9328 2.3885 2.1695 2.2083 1.6501 1.6492 1.5859 1.6407 2.3477 3.1810 1.8686 1.0541 1.0547 1.0575 1.0591 1.2977 1.1569 1.1232 1.1333 1.1687 1.3590 2.9358 2.2794 1.7218 1.4082 1.6946 1.9294 1.5215 1.5695 1.4279 1.4008 2.9529 2.8706 6.3645 7.0662 5.8774 5.7586 2.3257 2.3733 2.3136 2.3429 2.2098 2.1998 2.4378 2.5089 6.4565 6.1511 5.7656 5.8204 7.4870 8.2710 6.3239 5.9761 6.0333 6.6084 10.1129 11.7549 1.0849 1.0865 1.0878 1.0877 1.0858 1.0848 1.0868 1.0886 1.0875 1.0878 1.0876 1.0885 1.0930 1.0924 1.0928 1.0941 1.0962 1.0958 1.0960 1.0984 1.1016 1.1002 1.1004 1.0973
irintensity: 0.0585 1.0559 0.2394 0.2052 0.1384 0.1251 0.0630 0.4059 0.2900 0.3311 0.1147 0.2568 1.7423 1.0132 1.4135 0.8095 1.5395 2.3305 0.2882 0.6639 2.1135 0.3509 0.1606 0.4184 1.0843 4.7198 0.7542 0.1606 0.1343 0.4859 5.4399 2.6577 0.4198 6.9939 11.0439 6.1319 11.5860 3.5612 6.7305 7.1843 0.4346 0.5409 0.6716 0.1764 0.2577 2.2797 12.9106 1.3471 2.6838 12.4416 23.9661 17.3555 104.9788 22.1409 3.6938 60.1220 7.3107 60.9909 13.4816 27.1337 52.7081 1.3939 1.3166 1.3953 2.1667 3.4538 0.0967 1.1377 11.6631 16.6417 2.5168 3.1156 2.2419 4.9199 1.5019 12.0335 0.7400 1.0595 0.1143 1.6995 1.0151 0.0090 1.2498 1.2554 1.6625 0.1851 0.1126 0.2518 0.2662 10.1225 6.8229 3.6832 3.4606 7.2921 0.5655 0.3260 23.3208 2.3011 2.2068 14.9373 2.0693 8.5619 75.0690 14.0200 0.0343 0.0619 0.0068 0.2079 2.8237 0.0690 4.5187 0.7960 2.9368 0.7714 13.0650 3.4315 12.9172 4.4747 12.9897 23.8378 4.0100 25.8721 3.1476 3.1622 97.2410 9.2853 0.0714 2.1707 1.1391 1.7674 11.0744 9.7019 10.0442 7.6359 14.6369 17.7908 8.6600 16.7385 3.3859 26.5748 4.0239 3.8428 12.4516 82.4870 31.1878 4.0406 5.9674 0.1869 130.7005 285.9109 8.0580 5.3678 12.9592 7.8377 6.6783 0.9681 0.9492 3.3695 0.6891 0.2653 3.4605 4.1882 23.3325 22.4812 21.9576 33.0025 34.2156 23.5706 25.4676 32.5552 25.0138 18.6301 15.4879 6.8919
temp: 298.150 k
press: 1.00000 atm
elementType: 8 8 6 6 6 6 6 6 6 6 6 6 6 6 6 6 6 6 6 6 6 6 6 6 6 6 6 6 6 6 6 6 6 6 6 6 1 1 1 1 1 1 1 1 1 1 1 1 1 1 1 1 1 1 1 1 1 1 1 1
symmnumber: 1
zpe: 1233077.2 jmol-1
zpe.correction: 0.469654 hartree
zpe.thermalcorrener: 0.497987 hartree
zpe.thermalcorrenthalpy: 0.498932 hartree
zpe.thermalcorrgfe: 0.408020 hartree
zpe.sumelectzpe: -1458.025067 hartree
zpe.sumelectthermal: -1457.996734 hartree
zpe.sumelectthermalent: -1457.995790 hartree
zpe.sumelectthermalfe: -1458.086702 hartree
dipole: -1.3537 4.4197 -2.6103
dipole: 5.3085
quadrupole: -176.1239 -196.5368 -214.7085
quadrupole: 12.0003 5.0664 -8.7687
quadrupole: 19.6658 -0.7471 -18.9188 12.0003 5.0664 -8.7687
hfenergy: -1458.4947212 hartree
pointgroup: C01 [X(C34H24O2)]
dipole: -0.4333308 -1.5799264 1.2953496 debye
polarizability: 477.2132135|-8.5089802|453.4432165|-42.6718599|-64.0636949|243.3582342 unknown
InChI: InChI=1S/C34H24O2/c35-33-28(24-19-11-4-12-20-24)27(23-17-9-3-10-18-23)29-30-25(21-13-5-1-6-14-21)26(22-15-7-2-8-16-22)31(32(29)33)34(30)36/h1-20,29-32H
charge 0 multiplicity 1
60 atoms
O  -0.09953 0.181385 -2.868199
O  1.504667 3.324794 -0.286945
C  0.321448 -0.055483 0.552711
C  -0.000694 1.456778 0.337779
C  -0.552433 -0.785274 -0.547199
C  -1.025183 1.461084 -0.859679
C  -0.464493 0.270671 -1.686068
C  -2.037232 -0.57707 -0.211222
C  -2.311667 0.781266 -0.365436
C  1.829707 -0.177557 0.32107
C  1.351615 2.104081 -0.009725
C  2.414737 1.050164 0.041485
C  -2.917699 -1.715403 0.117102
C  -3.52539 1.563702 -0.047801
C  2.46322 -1.515373 0.343015
C  3.847807 1.384635 -0.138053
C  -4.302745 -1.723845 -0.222037
C  -2.374456 -2.876612 0.739979
C  -4.307398 1.273165 1.107875
C  -3.911636 2.667814 -0.85981
C  2.020762 -2.506402 1.266131
C  3.481353 -1.867561 -0.589684
C  4.250639 2.316076 -1.1344
C  4.840419 0.826262 0.71557
C  -5.111817 -2.838548 0.0731
C  -3.186788 -3.990671 1.039657
C  -5.44011 2.048271 1.428214
C  -5.051013 3.437718 -0.542832
C  2.595685 -3.794772 1.277598
C  4.042195 -3.159962 -0.588549
C  -4.561573 -3.976788 0.711122
C  -5.821805 3.132854 0.602745
C  5.612838 2.653033 -1.291145
C  6.198723 1.170052 0.561913
C  3.608344 -4.128234 0.348729
C  6.592465 2.081486 -0.447197
H  0.032906 -0.416995 1.555714
H  -0.440197 1.962936 1.213561
H  -0.242342 -1.807947 -0.795543
H  -1.122902 2.435763 -1.354128
H  -4.736573 -0.859318 -0.733663
H  -1.308269 -2.904689 0.994042
H  -4.014974 0.443006 1.759525
H  -3.329162 2.913629 -1.754973
H  1.24362 -2.258636 1.998813
H  3.814465 -1.128305 -1.324218
H  3.495569 2.775184 -1.778421
H  4.540694 0.130688 1.506898
H  -6.171757 -2.825747 -0.204425
H  -2.747537 -4.87018 1.523688
H  -6.021761 1.811768 2.326309
H  -5.33471 4.276555 -1.188037
H  2.254329 -4.537123 2.00751
H  4.815461 -3.414625 -1.321373
H  -5.193159 -4.842874 0.937486
H  -6.702041 3.735182 0.852987
H  5.907199 3.367672 -2.067691
H  6.94867 0.734109 1.231473
H  4.050388 -5.13064 0.350785
H  7.648422 2.348846 -0.567036
