program: Gaussian 09
title: 000023789
version: EM64L-G09RevD.01
frameworkgroup: C1[X(C14H19NOS)]
method: RPBEPBE
basis: SDD
operation: Freq
keyword: #p
keyword: freq=noraman
keyword: PBEPBE/SDD
title: #p freq=noraman PBEPBE/SDD
converged: YES YES NO NO
title: Mulliken charges:
elementType: S O N C C C C C C C C C C C C C C H H H H H H H H H H H H H H H H H H H
charge: 0.256923 -0.434824 -0.124654 -0.517032 0.551090 0.397773 -0.351619 -0.322620 -0.430784 -0.795639 -0.576934 -0.329099 -0.679781 0.470574 -0.273479 -0.373472 -0.823551 0.203589 0.223649 0.212333 0.196940 0.235928 0.186324 0.275646 0.270877 0.197643 0.218963 0.200176 0.235145 0.212455 0.240471 0.231543 0.229957 0.227218 0.226260 0.332013
chargesum: 0.00000
title: Mulliken charges with hydrogens summed into heavy atoms:
elementType: S O N C C C C C C C C C C C C C C
charge: 0.256923 -0.102810 -0.124654 -0.089794 0.551090 0.397773 0.057654 0.099632 -0.430784 -0.519994 -0.306058 0.087506 -0.032006 0.470574 -0.033008 -0.141929 -0.140116
polarizability: 2.06662874e+02 1.52445729e+00 2.09886341e+02 -5.20962262e+00 1.20414105e+01 1.17192938e+02
1716.lowfreq: -8.0646 -4.4575 -0.0011 -0.0010 0.0022 5.8770 20.1985 36.5420 46.9056
frequency: 20.1271 36.5355 46.9004 56.3552 62.7492 77.9650 96.9227 121.0288 149.8527 166.3825 214.3167 235.7573 251.1612 266.0099 287.7258 308.3695 317.8345 323.6132 367.0420 381.9777 423.8717 435.9467 466.1896 484.3365 505.0244 527.5928 599.5267 624.4451 680.2391 711.4585 747.1425 770.6120 786.7797 796.4774 798.4889 806.1013 812.8572 886.0801 902.6752 949.3990 953.7707 959.7696 990.7566 997.3805 1020.9756 1034.1782 1040.9214 1049.5589 1073.5627 1087.4595 1096.7484 1116.3461 1152.9499 1162.9776 1175.9790 1209.4584 1216.3233 1252.8620 1268.8750 1278.2786 1281.8411 1300.9151 1337.0914 1358.6659 1359.6824 1371.0298 1385.2183 1387.6488 1389.3616 1399.2427 1436.8928 1447.1167 1459.5439 1463.9306 1471.3820 1471.9017 1475.2163 1479.9398 1482.1714 1487.5591 1541.4195 1572.2742 1612.8789 2851.5642 2862.1155 2897.8666 2974.2063 2974.9070 2980.0655 3002.8259 3021.1250 3036.6404 3052.1578 3071.7577 3078.5795 3083.6744 3092.0221 3123.2952 3149.1842 3154.1841 3214.5483 3560.4372
redmass: 4.5113 4.6625 4.1765 1.0484 2.2759 2.4870 2.4042 3.4958 3.5583 2.6323 1.8073 2.9084 2.2200 3.5705 2.1922 3.6726 1.5449 2.3734 5.7985 2.8861 3.0974 3.7162 3.8456 3.9959 3.6217 5.5066 4.4440 4.9235 4.0378 5.4738 3.5856 2.6305 1.6516 1.6362 1.5908 1.3425 1.3499 3.4671 1.4347 2.5335 1.3550 3.2888 2.0641 1.4900 4.1244 2.7923 2.0989 1.5526 2.2842 2.0379 2.3060 1.6622 1.3431 1.5329 1.5402 2.2662 1.8154 1.5027 1.3854 1.2494 1.1510 1.2292 2.6545 1.3078 1.3194 1.3417 6.2327 1.2608 1.2835 1.2478 3.2888 3.1269 1.0617 1.0839 1.0625 1.0481 1.0589 1.2215 1.0791 1.0746 5.9150 7.1099 6.5752 1.0718 1.0714 1.0688 1.0661 1.0377 1.0363 1.0858 1.0899 1.0882 1.0976 1.0978 1.0993 1.0985 1.1003 1.0882 1.0920 1.0960 1.0955 1.0663
irintensity: 0.5893 0.9853 0.4540 0.4650 2.5875 3.7193 1.1579 1.1027 1.6835 2.3250 0.1336 0.6818 0.4255 4.5348 32.1542 7.5753 71.4421 27.2480 1.1104 25.4022 6.8989 2.2054 0.6625 0.5221 6.1348 1.6807 7.9503 3.6920 10.3457 1.6146 18.2364 18.0886 30.9354 16.1044 18.1328 1.5019 24.8994 1.9601 7.9484 18.9591 0.7233 133.6910 1.4970 6.7578 16.0756 22.4969 18.8639 12.9486 5.9549 30.9422 15.6744 25.9926 8.1443 1.7144 1.6458 2.3533 31.1114 15.4469 1.1410 0.7984 10.5840 8.4927 7.9113 0.6209 25.0827 3.1937 0.2000 21.9730 2.0124 12.1608 3.6588 29.1603 0.5646 8.2041 2.7303 11.8593 1.7186 17.4502 12.7951 6.4571 10.0672 3.7370 3.7026 44.8197 123.9929 104.3903 83.4476 34.6939 30.2420 16.1494 21.4115 4.3852 21.3082 51.0859 44.8861 20.0677 38.4276 10.6510 6.4489 15.1209 1.2064 7.1006
temp: 298.150 k
press: 1.00000 atm
elementType: 16 8 7 6 6 6 6 6 6 6 6 6 6 6 6 6 6 1 1 1 1 1 1 1 1 1 1 1 1 1 1 1 1 1 1 1
symmnumber: 1
zpe: 782340.3 jmol-1
zpe.correction: 0.297978 hartree
zpe.thermalcorrener: 0.316235 hartree
zpe.thermalcorrenthalpy: 0.317179 hartree
zpe.thermalcorrgfe: 0.249712 hartree
zpe.sumelectzpe: -1071.615761 hartree
zpe.sumelectthermal: -1071.597504 hartree
zpe.sumelectthermalent: -1071.596560 hartree
zpe.sumelectthermalfe: -1071.664027 hartree
dipole: 0.8799 -0.0654 2.0224
dipole: 2.2065
quadrupole: -107.1018 -102.2339 -116.6765
quadrupole: -6.9530 8.8239 3.7974
quadrupole: 1.5690 6.4368 -8.0058 -6.9530 8.8239 3.7974
hfenergy: -1071.9137385 hartree
pointgroup: C01 [X(C14H19N1O1S1)]
dipole: -0.3737681 0.1583027 0.7673714 debye
polarizability: 205.1865169|4.4012926|196.8949089|11.4826794|-34.1966244|131.6607273 unknown
InChI: InChI=1S/C14H19NOS/c1-3-15(6-7-16)9-12-10-17-14-5-4-11(2)8-13(12)14/h4-5,8,10,16H,3,6-7,9H2,1-2H3
charge 0 multiplicity 1
36 atoms
S  2.245791 2.763517 -1.200436
O  -4.257634 -2.632971 -0.976642
N  -2.055509 0.317031 0.002356
C  -1.389681 0.775381 -1.249373
C  0.035835 1.249156 -1.047028
C  1.102892 0.443008 -0.455591
C  -3.306886 -0.424306 -0.292468
C  -2.211693 1.399062 1.011415
C  2.367869 1.107919 -0.461472
C  0.483404 2.481948 -1.474962
C  1.025198 -0.867345 0.093408
C  -3.035035 -1.917636 -0.577365
C  -2.384203 0.857878 2.442481
C  2.175786 -1.500524 0.605923
C  3.530931 0.498177 0.049923
C  3.423003 -0.804005 0.576771
C  2.105961 -2.901639 1.189914
H  -1.974896 1.58683 -1.752334
H  -1.382885 -0.082748 -1.949908
H  -3.862974 0.008573 -1.158549
H  -3.977814 -0.350448 0.584745
H  -1.295208 2.014693 0.974921
H  -3.064325 2.077465 0.753515
H  -0.095229 3.272967 -1.951632
H  0.048029 -1.359282 0.134519
H  -2.558943 -2.382288 0.311155
H  -2.358528 -2.040338 -1.439537
H  -3.301227 0.249857 2.553364
H  -1.519249 0.228162 2.713945
H  -2.452164 1.694524 3.162324
H  4.495088 1.016687 0.040169
H  4.317991 -1.294917 0.97855
H  2.73997 -3.607058 0.619767
H  2.461125 -2.920252 2.237549
H  1.074483 -3.293477 1.176956
H  -4.893772 -2.632802 -0.217373
