program: Gaussian 09
title: 000252941
version: EM64L-G09RevD.01
frameworkgroup: C1[X(C11H18O2)]
method: RPBEPBE
basis: SDD
operation: Freq
keyword: #pfreq=noraman
keyword: PBEPBE/SDD
title: #p freq=noraman PBEPBE/SDD
converged: NO YES NO NO
title: Mulliken charges:
elementType: O O C C C C C C C C C C C H H H H H H H H H H H H H H H H H H
charge: -0.295510 -0.263900 0.013220 -0.427582 -0.430768 0.042241 -0.459303 -0.447340 -0.744216 0.243065 -0.347152 -0.072110 -0.734360 0.194240 0.192740 0.202971 0.202161 0.195699 0.233254 0.208397 0.211849 0.233740 0.203598 0.214905 0.208809 0.213835 0.256794 0.251436 0.233880 0.231602 0.233805
chargesum: 0.00000
title: Mulliken charges with hydrogens summed into heavy atoms:
elementType: O O C C C C C C C C C C C
charge: -0.295510 -0.263900 0.207459 -0.031871 -0.032908 0.275495 -0.039057 -0.010002 -0.106667 0.243065 -0.090358 0.179326 -0.035073
polarizability: 1.89822435e+02 -3.76743473e+00 1.05078424e+02 -2.54829062e-01 -5.66125994e+00 9.46103957e+01
1716.lowfreq: -8.6838 -4.8488 0.0004 0.0007 0.0009 13.4755 36.4284 41.6237 55.1108
frequency: 36.1056 41.6156 54.9912 107.0875 125.2194 181.5650 196.9161 201.0596 201.7259 217.0999 240.4059 274.1131 288.6743 352.7170 382.7231 407.9492 432.8393 463.3598 472.5007 591.4572 658.7961 700.2100 763.7457 785.0096 837.6959 843.5512 882.7637 889.2474 915.7035 919.9642 962.5990 964.5928 989.8262 991.4667 1014.4925 1031.5039 1053.0234 1058.2589 1091.1124 1097.9397 1112.5751 1155.5699 1156.9766 1183.2103 1221.9184 1243.6858 1249.6237 1288.2362 1294.2147 1297.6161 1299.2974 1308.6169 1313.2567 1337.9293 1347.9555 1350.3525 1366.5731 1384.5934 1393.2884 1457.0645 1457.4650 1461.9661 1464.5703 1468.2695 1474.3286 1476.2926 1477.5218 1610.9660 1670.0063 2943.4347 2959.3594 2964.4186 2968.9249 2970.1104 2984.5918 2987.2209 3009.3609 3025.6474 3032.3553 3042.8037 3053.2617 3059.5337 3062.6402 3066.6031 3085.2379 3108.8403 3150.9115
redmass: 3.5766 4.1087 3.6670 2.0787 2.2861 2.9437 1.9484 1.5370 1.6717 1.4095 3.5385 3.0320 3.0126 4.1705 3.6016 1.7144 2.9567 3.2598 2.7624 2.9924 3.4470 6.3912 2.6050 1.4573 2.0082 1.8870 2.0497 2.2993 2.1153 1.4310 1.3061 2.5885 3.6609 1.0911 1.6209 2.4119 1.5970 1.0562 2.2788 2.1326 2.3733 2.6885 2.5832 1.9571 1.3465 1.2704 1.4088 1.3857 1.2764 1.4049 1.2804 1.3783 1.2825 1.4691 1.7004 1.5417 1.5202 1.2212 1.2317 1.0475 1.0850 1.0890 1.0704 1.0839 1.0577 1.0764 1.0698 11.2599 5.8259 1.0805 1.0628 1.0486 1.0516 1.0373 1.0627 1.0645 1.0832 1.0975 1.0977 1.0958 1.1017 1.0999 1.1010 1.0992 1.0965 1.0938 1.0922
irintensity: 0.2640 2.3336 1.3336 1.1772 0.8180 2.0735 1.1817 0.1069 0.5567 0.0056 0.9244 3.2289 3.2284 6.1050 3.0332 0.2150 4.4608 0.2676 0.2794 0.3268 11.1129 4.0536 0.9388 0.3840 1.4517 2.0956 5.3533 4.6915 3.8609 5.7899 3.2142 6.8904 271.8927 65.1269 18.5428 5.7080 0.2263 0.1856 58.3251 100.2662 4.2369 139.9897 87.0749 0.6072 0.8431 0.4829 3.4674 86.7223 0.0346 2.7015 10.6643 36.1880 2.9977 0.6892 1.7646 0.6694 5.4946 10.1929 13.6764 16.5137 0.8322 11.5245 43.1728 11.6783 20.2384 5.0487 6.0930 157.3984 113.5491 6.0725 27.2324 12.6572 102.8289 15.1050 9.8100 17.4276 17.1711 57.9048 33.0189 17.8529 24.7998 10.1839 108.7053 43.7787 9.3514 17.1615 8.9864
temp: 298.150 k
press: 1.00000 atm
elementType: 8 8 6 6 6 6 6 6 6 6 6 6 6 1 1 1 1 1 1 1 1 1 1 1 1 1 1 1 1 1 1
symmnumber: 1
zpe: 702930.6 jmol-1
zpe.correction: 0.267732 hartree
zpe.thermalcorrener: 0.282036 hartree
zpe.thermalcorrenthalpy: 0.282981 hartree
zpe.thermalcorrgfe: 0.225988 hartree
zpe.sumelectzpe: -579.390093 hartree
zpe.sumelectthermal: -579.375788 hartree
zpe.sumelectthermalent: -579.374844 hartree
zpe.sumelectthermalfe: -579.431837 hartree
dipole: 0.2751 1.1409 -1.1483
dipole: 1.6419
quadrupole: -62.3616 -81.6453 -81.1951
quadrupole: 1.7834 -2.4601 1.9758
quadrupole: 12.7057 -6.5780 -6.1278 1.7834 -2.4601 1.9758
hfenergy: -579.6578248 hartree
pointgroup: C01 [X(C11H18O2)]
dipole: 0.0903264 0.2554687 -0.5864008 debye
polarizability: 189.9536384|-1.7501044|99.7237042|-0.5738104|-7.6478614|99.8339122 unknown
InChI: InChI=1S/C11H18O2/c1-3-4-11(12)13-10-7-5-9(2)6-8-10/h3-4,9-10H,5-8H2,1-2H3
charge 0 multiplicity 1
31 atoms
O  0.752253 0.351903 -0.559305
O  1.733212 -0.715455 1.28368
C  -3.531089 -0.286247 -0.40398
C  -2.95057 1.098857 -0.014448
C  -2.606038 -1.414154 0.123247
C  -0.609648 0.14249 0.034404
C  -1.491751 1.277764 -0.500365
C  -1.145508 -1.245019 -0.362627
C  -4.978223 -0.457762 0.103061
C  1.846486 -0.127315 0.176382
C  3.106049 0.178403 -0.541255
C  4.315696 -0.17261 -0.022855
C  5.648667 0.099245 -0.665931
H  -3.537564 -0.347872 -1.51472
H  -2.991783 1.204734 1.090555
H  -3.58262 1.905722 -0.433577
H  -2.991036 -2.401596 -0.197517
H  -2.631672 -1.409457 1.233585
H  -0.506574 0.198807 1.135913
H  -1.458565 1.263263 -1.607681
H  -1.085844 2.252811 -0.172677
H  -0.498992 -2.03124 0.067408
H  -1.103159 -1.337549 -1.466205
H  -5.396696 -1.435593 -0.200534
H  -5.016446 -0.404249 1.208515
H  -5.640965 0.333257 -0.295193
H  3.010962 0.701706 -1.498598
H  4.315886 -0.694694 0.946127
H  6.285857 0.712237 0.001289
H  5.545534 0.625562 -1.629878
H  6.199039 -0.84615 -0.839621
