program: Gaussian 09
title: 000252940
version: EM64L-G09RevD.01
frameworkgroup: C1[X(C10H18O5)]
method: RPBEPBE
basis: SDD
operation: Freq
keyword: #pfreq=noraman
keyword: PBEPBE/SDD
title: #p freq=noraman PBEPBE/SDD
converged: YES YES NO NO
title: Mulliken charges:
elementType: O O O O O C C C C C C C C C C H H H H H H H H H H H H H H H H H H
charge: -0.270956 -0.239740 -0.234251 -0.218355 -0.279751 -0.102393 -0.357341 -0.271056 0.257611 -0.362751 -0.700820 -0.279206 -0.679611 -0.677241 0.326744 0.262099 0.214095 0.240825 0.228863 0.219326 0.216280 0.232639 0.234920 0.240559 0.239811 0.223130 0.229858 0.217660 0.227481 0.208193 0.210259 0.225859 0.217260
chargesum: 0.00000
title: Mulliken charges with hydrogens summed into heavy atoms:
elementType: O O O O O C C C C C C C C C C
charge: -0.270956 -0.239740 -0.234251 -0.218355 -0.279751 0.159706 0.097579 0.177133 0.257611 0.086168 0.014469 0.173781 -0.026276 -0.023863 0.326744
polarizability: 1.55563200e+02 3.02784555e+00 1.23685549e+02 -7.04609721e+00 -1.98200799e+00 1.02207470e+02
1716.lowfreq: -4.6371 0.0003 0.0007 0.0009 3.6466 5.6951 16.3240 37.3149 42.7453
frequency: 15.9982 37.1854 42.6884 56.5903 60.2138 74.1773 83.7611 91.2678 100.5579 150.2202 197.5449 214.3827 219.8859 227.6939 240.0860 262.4431 273.3818 290.8436 294.3649 326.9116 374.7597 400.3408 492.2731 585.6808 621.3649 653.4337 692.4465 704.8154 759.4742 764.6701 797.2275 836.9878 856.8423 880.7023 892.1809 896.7510 911.7987 942.7121 1008.1334 1043.5738 1046.6127 1048.9479 1083.2578 1113.3490 1121.7265 1125.4059 1148.4280 1162.2968 1166.0383 1194.8735 1247.2491 1249.8856 1285.2924 1291.8202 1292.3229 1309.0972 1310.2388 1324.0414 1369.7355 1373.5890 1390.5459 1394.4012 1395.8268 1455.8273 1456.6248 1465.4471 1476.9127 1477.0831 1477.9809 1479.9377 1480.9840 1488.0594 1488.2127 1623.0474 1658.7314 2979.3717 2979.7561 3002.5155 3005.1591 3007.4894 3022.8140 3026.1417 3037.9638 3050.9146 3052.2960 3077.1775 3077.3951 3084.3620 3084.7174 3105.3599 3110.0435 3111.7984 3118.2964
redmass: 4.1413 4.2789 3.2158 3.9254 4.0540 2.2408 1.9610 3.5819 5.9326 3.9062 3.3963 1.2471 1.1415 1.1595 2.7395 2.7530 2.6987 3.5413 3.8741 6.7920 5.0198 4.4956 4.9803 4.6395 5.4752 5.9532 7.5196 5.6447 1.1350 1.0958 2.9164 3.5329 3.2252 1.7617 1.2716 1.3889 2.2427 3.6558 2.9110 2.7132 3.0182 2.6672 3.4868 2.8330 2.2134 2.3638 2.4841 1.7034 1.7305 4.4149 1.2301 1.2262 1.5009 1.1102 1.1296 1.3025 1.3052 1.3775 1.3717 1.3637 1.2133 1.2050 1.2044 1.1045 1.0936 1.0476 1.0485 1.0507 1.0536 1.0441 1.0429 1.0844 1.0836 9.5949 10.2290 1.0359 1.0359 1.0601 1.0606 1.0349 1.0578 1.0587 1.0845 1.1009 1.1006 1.1020 1.1019 1.0989 1.0990 1.1083 1.1083 1.1011 1.1005
irintensity: 0.4482 2.6302 0.5637 1.4875 0.2064 0.6112 0.0301 0.5374 0.8108 2.2116 1.4592 0.1020 0.2173 0.2665 0.4617 4.3218 3.3173 8.0541 3.4133 21.7029 27.0085 3.0656 2.7583 2.4030 8.0840 4.5664 15.4250 12.8659 8.0998 8.3234 1.8524 6.8476 27.4818 10.8813 5.0940 9.2038 55.0764 54.5033 50.6950 13.1527 7.9184 60.9019 445.7233 43.6624 20.0303 6.2433 254.4988 4.4554 3.2271 575.2535 3.5700 2.1082 15.6126 3.7462 9.0102 6.2188 5.3784 27.8063 0.7881 5.4719 19.1142 9.3364 9.7446 14.7929 6.6832 15.7747 2.6907 8.3999 16.0046 10.8398 12.5132 18.6609 17.1646 234.7420 128.2605 36.0074 32.5590 11.0616 7.9528 13.4298 47.0646 39.1509 5.0095 0.5343 1.5549 30.1417 35.6682 39.3897 37.5027 38.8666 35.3940 18.5394 14.9763
temp: 298.150 k
press: 1.00000 atm
elementType: 8 8 8 8 8 6 6 6 6 6 6 6 6 6 6 1 1 1 1 1 1 1 1 1 1 1 1 1 1 1 1 1 1
symmnumber: 1
zpe: 716466.0 jmol-1
zpe.correction: 0.272888 hartree
zpe.thermalcorrener: 0.291178 hartree
zpe.thermalcorrenthalpy: 0.292123 hartree
zpe.thermalcorrgfe: 0.223588 hartree
zpe.sumelectzpe: -766.773995 hartree
zpe.sumelectthermal: -766.755704 hartree
zpe.sumelectthermalent: -766.754760 hartree
zpe.sumelectthermalfe: -766.823294 hartree
dipole: 0.8258 -0.4435 -1.5329
dipole: 1.7968
quadrupole: -68.6579 -86.4629 -94.1056
quadrupole: 3.8638 -0.7200 -4.0222
quadrupole: 14.4176 -3.3874 -11.0302 3.8638 -0.7200 -4.0222
hfenergy: -767.0468821 hartree
pointgroup: C01 [X(C10H18O5)]
dipole: -0.3232063 0.023695 0.6282476 debye
polarizability: 155.1611559|-6.1023228|123.2961128|-6.0679921|-4.2462521|102.9989505 unknown
InChI: InChI=1S/C10H18O5/c1-4-6-13-9(11)8(3)15-10(12)14-7-5-2/h8H,4-7H2,1-3H3
charge 0 multiplicity 1
33 atoms
O  -2.697661 0.790254 0.143745
O  0.781897 1.407994 -0.843906
O  2.583019 0.120585 -1.090235
O  -1.407345 -0.237208 -1.515355
O  1.052446 -0.416728 0.613792
C  -0.523397 1.692635 -0.205784
C  -3.646443 -1.433631 0.756854
C  -3.815025 -0.175434 -0.105008
C  -1.548917 0.623321 -0.624049
C  4.380158 -0.645379 0.47227
C  -0.926861 3.097349 -0.669872
C  3.445588 -1.032206 -0.680879
C  -4.831105 -2.404793 0.555413
C  5.336995 -1.806741 0.82327
C  1.438617 0.288353 -0.347005
H  -0.414084 1.642261 0.892797
H  -3.571688 -1.138172 1.820057
H  -2.697662 -1.931771 0.486322
H  -3.830512 -0.428111 -1.180783
H  -4.71986 0.392716 0.167643
H  4.959997 0.251048 0.182659
H  3.772863 -0.378884 1.356859
H  -1.894364 3.373861 -0.2196
H  -0.161049 3.826387 -0.357356
H  -1.015494 3.131637 -1.768688
H  4.006696 -1.267562 -1.599838
H  2.794795 -1.880459 -0.401589
H  -4.905095 -2.734427 -0.497598
H  -4.704956 -3.306044 1.180781
H  -5.792854 -1.93396 0.833628
H  5.96781 -2.086714 -0.041327
H  6.009631 -1.519448 1.650552
H  4.777557 -2.705929 1.141925
