program: Gaussian 09
title: 000252936
version: EM64L-G09RevD.01
frameworkgroup: C1[X(C8H16O2)]
method: RPBEPBE
basis: SDD
operation: Freq
keyword: #pfreq=noraman
keyword: PBEPBE/SDD
title: #p freq=noraman PBEPBE/SDD
converged: YES YES NO NO
title: Mulliken charges:
elementType: O O C C C C C C C C H H H H H H H H H H H H H H H H
charge: -0.293255 -0.266146 0.378016 0.030407 -0.389599 -0.341587 -0.400986 -0.717743 -0.717078 -0.704304 0.183852 0.221728 0.197535 0.182643 0.228193 0.201312 0.200267 0.231924 0.210074 0.232863 0.226143 0.200837 0.232493 0.234950 0.233738 0.203724
chargesum: 0.00000
title: Mulliken charges with hydrogens summed into heavy atoms:
elementType: O O C C C C C C C C
charge: -0.293255 -0.266146 0.378016 0.214259 0.029663 0.069249 0.000593 -0.042882 -0.057605 -0.031893
polarizability: 1.01230970e+02 4.76865313e-01 8.83736992e+01 -2.41332938e+00 -3.85432251e-01 8.50157295e+01
1716.lowfreq: -6.4630 -4.4006 0.0003 0.0003 0.0006 26.0621 81.4065 115.3262 127.8649
frequency: 81.1926 115.3075 127.8148 183.7608 199.0031 205.9846 233.1102 257.2265 285.9905 324.1742 353.5306 394.1642 424.7041 458.8942 483.6562 542.2500 587.8510 694.8513 732.1026 814.8441 826.9250 850.4088 882.4685 911.1829 960.5867 973.5501 999.4472 1024.8289 1033.9311 1050.9359 1080.9743 1130.8822 1134.7815 1147.1110 1163.4570 1210.1875 1225.4642 1249.5755 1279.7539 1303.9094 1325.1593 1345.7780 1353.2558 1365.9367 1376.3564 1382.9538 1389.8937 1434.0266 1446.4830 1458.8804 1459.9973 1465.7451 1471.3422 1479.4414 1483.7820 1493.8553 2934.6480 2949.6419 2988.3316 2991.5733 2992.2595 2996.2467 3001.0833 3053.9424 3059.5972 3076.5586 3086.6745 3088.1624 3093.2713 3097.7432 3101.1437 3108.1410
redmass: 2.0697 2.8300 2.1702 1.1504 1.2363 1.1864 2.1052 2.0970 2.1933 2.8259 2.9330 2.7105 3.9974 2.4710 3.2919 3.6052 2.4255 3.7894 2.1386 2.1413 1.6324 2.0736 3.3295 2.2375 1.5304 1.4110 1.4266 1.5148 2.7822 3.7564 2.6723 2.6286 1.9035 2.5155 1.9149 1.4005 1.4468 1.9953 1.1639 1.2860 1.2455 1.6380 1.3315 1.5797 1.2124 1.2136 1.2612 1.0965 1.0805 1.0501 1.0732 1.0416 1.0562 1.0488 1.0631 1.0539 1.0826 1.0685 1.0432 1.0495 1.0419 1.0398 1.0524 1.1013 1.1006 1.0967 1.0985 1.0991 1.0989 1.1002 1.1002 1.1009
irintensity: 0.2299 3.0721 0.9265 0.6878 0.6780 0.4538 1.5254 2.3086 1.6562 5.2412 5.7089 0.8755 2.9092 0.7848 2.9455 5.5527 3.0464 8.1680 7.9871 3.0728 37.9295 1.3684 31.1858 41.0835 4.3634 5.0016 38.9431 27.9849 8.2403 33.0960 104.5614 15.8738 11.8236 45.2920 22.3438 8.6871 25.6073 38.4964 7.7089 6.2950 4.3520 5.1847 12.7820 10.2453 22.3447 26.4411 25.2121 7.9910 5.7763 11.6664 3.6071 7.8157 14.1035 11.2530 2.3807 13.6563 35.7860 76.6256 10.4118 42.3368 43.0473 22.2191 29.6359 11.0081 31.7274 36.9350 40.7347 20.0632 48.2533 32.5085 10.6500 43.0384
temp: 298.150 k
press: 1.00000 atm
elementType: 8 8 6 6 6 6 6 6 6 6 1 1 1 1 1 1 1 1 1 1 1 1 1 1 1 1
symmnumber: 1
zpe: 599883.4 jmol-1
zpe.correction: 0.228484 hartree
zpe.thermalcorrener: 0.239847 hartree
zpe.thermalcorrenthalpy: 0.240791 hartree
zpe.thermalcorrgfe: 0.192576 hartree
zpe.sumelectzpe: -464.054002 hartree
zpe.sumelectthermal: -464.042639 hartree
zpe.sumelectthermalent: -464.041694 hartree
zpe.sumelectthermalfe: -464.089910 hartree
dipole: 1.8871 1.1142 0.8250
dipole: 2.3417
quadrupole: -58.6660 -63.3663 -62.1042
quadrupole: 2.1723 -2.5146 0.8668
quadrupole: 2.7129 -1.9875 -0.7254 2.1723 -2.5146 0.8668
hfenergy: -464.2824858 hartree
pointgroup: C01 [X(C8H16O2)]
dipole: -0.730107 0.4070792 -0.3873014 debye
dipolederiv: -1.1484732 -0.2095308 0.0591746 -0.128023 -0.5414076 -0.0282518 0.1063187 -0.0282672 -0.520483 -0.7256199 0.18194 0.1722648 0.1238314 -0.746232 -0.1458442 0.1765703 -0.1658035 -0.5960745 0.8956989 0.0834822 -0.0952788 0.1822889 0.8399016 0.0582095 -0.2479591 0.1326987 0.8290146 0.7458102 0.0450963 0.0045637 -0.1422073 0.2824516 0.0301282 -0.0090158 0.0487221 0.398615 -0.0872952 -0.0940126 0.0260885 -0.0771254 -0.1181875 -0.0931487 0.0307073 -0.0855941 0.0150669 0.5702291 -0.2051106 -0.1151187 -0.0737497 0.4018072 -0.0266878 -0.0564593 -0.0854585 0.3030367 -0.0089057 0.0456377 0.0042461 0.047907 0.0585842 0.0398302 -0.0225141 0.0506858 0.0209182 -0.0550655 0.0205649 -0.0412597 -0.0308027 -0.0835136 0.1289844 0.0592216 0.0815597 -0.271759 -0.0436727 -0.0886514 0.0176035 -0.1041975 -0.0607891 -0.0051411 0.0133765 -0.0122525 0.0497958 0.0334672 0.0181308 -0.0300982 0.0031537 0.0206863 0.0610393 0.0174046 0.0378971 -0.0511828 -0.0439677 0.0074277 -0.013557 0.0818258 -0.0477088 0.1108733 -0.0523072 0.082237 -0.1714835 0.0883862 -0.0033605 -0.039454 -0.0245058 0.0012226 0.1039883 0.0038846 0.0605816 -0.0930232 -0.1646109 0.105378 0.0265075 0.1014325 0.0459342 -0.0088784 -0.0041647 0.0082825 0.0830003 -0.0506518 0.0721258 -0.0124832 0.0259142 -0.0353108 0.088916 -0.0568897 0.192737 -0.1146576 0.0272343 -0.0041678 -0.002831 0.004662 -0.0556804 -0.1020348 0.0147334 -0.1539039 -0.0483394 -0.0674151 -0.0954976 0.0354908 -0.1302986 -0.0353871 0.0551571 0.0032272 0.0529637 0.0532837 0.0727891 0.0164732 0.0080322 0.0655721 -0.022369 -0.1071964 0.0220748 -0.0976133 -0.0936251 0.0938259 0.0163249 0.0344999 0.0339889 -0.0227284 -0.1307056 0.0381166 -0.0925052 -0.0140794 -0.0853247 0.1187771 -0.0794389 0.1080465 0.0300168 0.0436702 -0.051841 0.0277227 0.0717574 -0.0510556 -0.1217003 0.042204 -0.1226089 0.0136808 0.0217121 0.0119011 0.0011026 0.0858142 0.0911803 0.0322824 -0.0647503 -0.0146712 0.0424381 0.0605775 -0.0205892 0.1080079 -0.087887 -0.1630801 0.0347837 0.0032417 0.0917224 0.0539296 0.0060606 0.010791 0.0082407 0.101274 0.1046928 0.0244223 0.0323016 -0.0256372 -0.0375935 -0.1070513 0.0033639 -0.129227 -0.0360132 0.116133 0.0065459 0.0473346 -0.0124937 -0.0004642 -0.1323978 0.030835 -0.0877414 -0.039713 0.0074128 -0.1463154 0.0501202 -0.1169537 -0.006998 0.0256993 0.0281361 0.0021175 0.0728206 -0.1517216 0.1389544 -0.0694039 0.1329294 0.0237169 0.0524919 -0.0489227 0.0428099 0.053923 unknown
polarizability: 101.2662205|-0.988608|88.4465906|-2.096908|-0.0158831|84.9075872 unknown
InChI: InChI=1S/C8H16O2/c1-4-8(3)9-6-5-7(2)10-8/h7H,4-6H2,1-3H3
charge 0 multiplicity 1
26 atoms
O  -0.227121 -0.880542 -0.331133
O  0.700989 1.184172 0.57657
C  0.846819 0.12753 -0.447544
C  -1.607131 -0.329099 -0.328455
C  -1.727852 0.728971 0.788368
C  -0.637939 1.801697 0.60805
C  2.154909 -0.608763 -0.105361
C  0.880788 0.738693 -1.865603
C  -2.533046 -1.532156 -0.145084
C  2.162501 -1.247154 1.297034
H  -1.809884 0.152921 -1.311814
H  -1.60081 0.232473 1.768314
H  -2.730788 1.198811 0.761145
H  -0.820219 2.388143 -0.318767
H  -0.602019 2.500281 1.459946
H  2.978989 0.124004 -0.196377
H  2.311466 -1.383555 -0.879567
H  1.023045 -0.064653 -2.608701
H  -0.046657 1.279248 -2.120416
H  1.721982 1.449027 -1.940072
H  -2.31488 -2.038372 0.811743
H  -3.590909 -1.211007 -0.143199
H  -2.386634 -2.260167 -0.961421
H  2.014011 -0.476792 2.072184
H  1.35148 -1.989089 1.387307
H  3.12651 -1.754522 1.485255
