program: Gaussian 09
title: 000252934
version: EM64L-G09RevD.01
frameworkgroup: C1[X(C8H13Cl3)]
method: RPBEPBE
basis: SDD
operation: Freq
keyword: #pfreq=noraman
keyword: PBEPBE/SDD
title: #p freq=noraman PBEPBE/SDD
converged: NO YES NO NO
title: Mulliken charges:
elementType: Cl Cl Cl C C C C C C C C H H H H H H H H H H H H H
charge: -0.090775 -0.053182 -0.034895 0.057957 -0.450121 -0.421332 -0.387091 -0.402133 -0.382432 -0.392866 -0.602296 0.289383 0.268144 0.201690 0.236575 0.179916 0.276165 0.206404 0.227834 0.195978 0.240695 0.274402 0.293122 0.268857
chargesum: 0.00000
title: Mulliken charges with hydrogens summed into heavy atoms:
elementType: Cl Cl Cl C C C C C C C C
charge: -0.090775 -0.053182 -0.034895 0.347340 0.019713 -0.004841 -0.110926 0.032105 0.054242 -0.118463 -0.040317
polarizability: 1.13037134e+02 3.05164386e+00 1.09912674e+02 2.87479904e+00 -4.73072333e+00 9.94990559e+01
1716.lowfreq: -17.4198 -11.9207 -0.0016 0.0013 0.0021 3.2143 38.0192 53.7520 90.2390
frequency: 37.5505 53.7211 90.2367 124.3477 138.9946 169.6008 230.2798 261.6585 305.1611 335.6706 350.2020 403.2039 432.4873 468.0369 519.1518 541.2116 612.8090 665.4782 686.8962 788.1459 846.3455 857.1718 889.2335 898.2913 925.8733 949.2775 1001.4382 1057.1066 1067.8353 1084.5225 1095.0957 1109.1381 1139.9961 1163.7953 1187.0964 1200.3494 1216.5901 1233.2982 1256.9917 1269.5534 1288.0666 1303.1472 1320.8733 1329.7310 1343.3617 1347.8418 1350.7650 1369.0576 1435.6130 1447.5267 1452.8108 1468.2217 1471.9707 2947.0446 2952.3129 2960.8205 2996.0197 3004.9811 3022.0494 3052.5886 3053.7112 3055.7326 3057.5044 3062.2086 3071.5487 3138.3138
redmass: 7.9617 12.5435 7.5712 5.2510 5.9473 5.5370 3.4790 2.5056 3.7080 3.1315 2.2751 2.1702 3.8533 2.6371 3.7288 4.8795 4.4736 3.7981 3.0056 2.0887 2.6826 1.4410 2.1535 2.0149 2.1740 1.8870 2.7277 1.4206 1.7500 1.7183 1.7261 1.7864 1.1537 1.3641 1.4712 1.2723 1.2981 1.5485 1.2717 1.2417 1.3062 1.3493 1.3401 1.3446 1.4045 1.5224 1.5214 1.4616 1.0897 1.0846 1.0857 1.0809 1.0908 1.0663 1.0679 1.0669 1.0610 1.0821 1.0833 1.0927 1.0709 1.0885 1.0915 1.0991 1.0893 1.1072
irintensity: 0.3358 0.0942 2.0617 0.8582 0.6967 6.7224 0.6484 0.5147 4.0396 6.7142 1.4916 1.3667 1.8265 3.6347 20.6917 6.5863 26.6224 25.2435 2.7246 4.5357 5.2379 11.3965 2.7305 9.7035 16.0292 28.4040 3.1444 1.6372 0.9478 9.4707 0.4530 4.6136 2.1606 4.5589 1.8810 2.9875 16.2947 7.3659 13.0343 15.2116 19.6196 5.6843 6.7997 4.2729 6.8988 0.6220 2.3746 1.7170 30.1042 7.1180 4.3032 14.7399 8.8698 10.9775 32.2497 37.9838 29.5734 2.1819 6.4700 37.4138 17.9229 17.0845 16.8655 39.4519 25.8830 5.5988
temp: 298.150 k
press: 1.00000 atm
elementType: 17 17 17 6 6 6 6 6 6 6 6 1 1 1 1 1 1 1 1 1 1 1 1 1
symmnumber: 1
zpe: 514200.8 jmol-1
zpe.correction: 0.195849 hartree
zpe.thermalcorrener: 0.207687 hartree
zpe.thermalcorrenthalpy: 0.208631 hartree
zpe.thermalcorrgfe: 0.156251 hartree
zpe.sumelectzpe: -1691.963463 hartree
zpe.sumelectthermal: -1691.951625 hartree
zpe.sumelectthermalent: -1691.950681 hartree
zpe.sumelectthermalfe: -1692.003061 hartree
dipole: 1.3567 -2.0514 4.3737
dipole: 5.0178
quadrupole: -91.5632 -93.6140 -83.1827
quadrupole: -4.8192 -1.7186 1.5514
quadrupole: -2.1099 -4.1607 6.2706 -4.8192 -1.7186 1.5514
hfenergy: -1692.1593116 hartree
pointgroup: C01 [X(C8H13Cl3)]
dipole: -0.599101 -0.6050651 -1.7810687 debye
dipolederiv: -0.2741569 0.0196036 0.0407477 0.0411189 -0.39113 -0.1854814 0.0885849 -0.2407367 -0.4632036 -0.4270664 0.1730637 -0.1021868 0.1688554 -0.3962817 0.146091 -0.1406237 0.2141037 -0.2832143 -0.2058196 -0.051633 -0.0073381 -0.0821741 -0.3469063 -0.1212288 -0.0480466 -0.1939941 -0.2732479 -0.0529941 0.0384843 0.031752 0.0783538 -0.0467182 0.0507099 -0.0151031 0.0515146 -0.0505196 -0.1543791 0.0254034 0.000044 -0.0305794 0.0075357 0.0070254 0.1719647 -0.0868853 0.0679587 -0.0366547 0.0051913 0.0166861 0.0514262 0.0614431 0.0597931 0.0030955 0.0942495 0.1545817 0.3235495 -0.0081549 -0.0537327 -0.0069047 0.4576424 0.2846745 -0.1983848 0.3927502 0.5744574 0.0617516 0.0005038 -0.0005822 -0.0228977 0.0840477 0.0321845 -0.0118044 -0.0094982 0.0893028 -0.0122309 -0.0361917 0.0073405 -0.0074534 -0.0375176 0.0160554 0.0472343 -0.049221 0.0205694 0.4981252 -0.2652665 0.1618909 -0.3317099 0.381292 -0.2129317 0.1309564 -0.3621092 0.3249695 0.036275 0.064744 0.0134823 0.0919069 0.3796047 0.2655949 0.0728742 0.3784816 0.3182507 0.0860172 -0.0129641 -0.011041 -0.0156377 0.049374 -0.0434936 -0.0144247 -0.0273 -0.0278934 0.0336793 -0.0812414 0.0258553 -0.0850689 -0.0866794 0.0398449 -0.0011728 0.0287755 0.0716675 0.0362217 0.0516623 0.0453767 0.0237744 0.046471 -0.1189493 -0.0020179 -0.0490372 -0.1257607 0.037945 0.0914907 -0.0583107 0.056728 -0.0210131 0.059989 -0.0539472 0.0871725 0.0144706 0.0338739 -0.0192256 0.0211397 -0.0203328 0.0238539 -0.04959 0.029665 -0.1321046 -0.15441 -0.0266603 0.0639242 -0.046216 0.0697862 -0.0635872 0.0307585 -0.0291284 0.0217997 -0.0781479 -0.0431848 -0.1072483 0.01488 -0.1200479 -0.1420327 0.0391082 0.0055238 0.0152967 0.0837207 0.0435729 0.0242824 -0.0217458 0.0363717 0.0713598 -0.0940114 0.0047511 -0.0339378 -0.1007006 0.1092811 -0.0129094 -0.0023533 -0.0247099 -0.0253948 -0.1006634 -0.0449232 -0.0449174 -0.1339047 -0.1588107 0.0355025 0.0356044 0.0526627 0.0533169 0.0037467 0.0774751 0.0178989 0.0765219 0.0347867 -0.0190253 -0.0719202 0.0258327 -0.0462431 -0.0592561 0.000142 0.006717 -0.0796829 -0.0641079 -0.003416 0.0470644 0.0217875 0.03741 -0.0769243 0.0082234 -0.078174 0.0390076 0.1209864 0.02342 -0.0864371 0.028912 -0.0498472 0.0269539 -0.0809136 -0.0008446 -0.0647929 unknown
polarizability: 112.4231007|-3.577544|109.6694937|3.0574697|5.2980685|100.35627 unknown
InChI: InChI=1S/C8H13Cl3/c9-5-8(11)6-2-1-3-7(10)4-6/h6-8H,1-5H2
charge 0 multiplicity 1
24 atoms
Cl -2.053439 1.867108 1.132255
Cl 2.659994 -1.623934 0.694361
Cl 2.584756 1.923976 0.660133
C  0.255392 -0.296593 0.00571
C  -0.504125 0.702403 -0.914822
C  -0.5203 -1.636419 0.102576
C  -1.979086 0.878697 -0.517377
C  -1.971927 -1.423231 0.586799
C  -2.733259 -0.444472 -0.332933
C  1.687437 -0.509032 -0.519909
C  2.529843 0.732578 -0.795019
H  0.325032 0.158574 1.012671
H  -0.015219 1.692013 -0.91156
H  -0.498497 0.323301 -1.961132
H  0.012759 -2.319474 0.787399
H  -0.531453 -2.123786 -0.896755
H  -2.497473 1.556505 -1.214665
H  -2.503912 -2.392282 0.62048
H  -1.964848 -1.0200 1.617304
H  -2.844442 -0.897279 -1.342323
H  -3.750568 -0.246142 0.048048
H  1.676594 -1.115132 -1.447438
H  3.576196 0.46908 -1.002311
H  2.107143 1.31284 -1.631091
