program: Gaussian 09
title: 000260960
version: EM64L-G09RevD.01
frameworkgroup: C1[X(C13H24O3)]
method: RPBEPBE
basis: SDD
operation: Freq
keyword: #pfreq=noraman
keyword: PBEPBE/SDD
title: #p freq=noraman PBEPBE/SDD
converged: YES YES NO NO
title: Mulliken charges:
elementType: O O O C C C C C C C C C C C C C H H H H H H H H H H H H H H H H H H H H H H H H
charge: -0.262296 -0.273354 -0.234695 -0.022608 -0.427241 -0.408739 -0.361073 -0.322722 -0.356242 -0.725970 -0.697596 -0.291900 -0.507424 0.257218 0.046070 -0.570942 0.209437 0.185299 0.199313 0.228491 0.202566 0.189629 0.201591 0.198502 0.201444 0.194375 0.194993 0.224605 0.217430 0.213428 0.209685 0.210337 0.215517 0.211258 0.223536 0.238729 0.265182 0.259455 0.228042 0.236670
chargesum: 0.00000
title: Mulliken charges with hydrogens summed into heavy atoms:
elementType: O O O C C C C C C C C C C C C C
charge: -0.262296 -0.273354 -0.234695 0.186829 -0.042630 0.022318 0.030148 0.077224 0.033126 -0.070507 -0.062057 0.142894 -0.003513 0.257218 0.305526 -0.106230
polarizability: 1.56106045e+02 3.89318099e+00 1.68011905e+02 -1.21729993e+00 1.09024651e+01 1.37246778e+02
1716.lowfreq: -20.8742 -6.9756 -0.0007 -0.0006 -0.0004 1.9187 9.8863 16.2586 36.3136
frequency: -15.9478 16.1526 35.9759 43.8401 51.8336 71.9642 82.2039 85.8337 104.6514 122.7422 133.7020 151.6895 178.7136 194.1277 227.7331 239.7919 255.2369 258.1187 269.9227 303.2703 331.4351 360.5956 408.5086 442.9108 453.9128 531.0583 537.0776 551.8715 675.6323 698.2286 727.4435 759.2207 775.0496 789.7436 804.5491 834.9970 888.1104 910.8061 911.6162 914.4809 924.2510 968.7410 969.8100 977.1177 993.0649 1003.8089 1025.5709 1035.8539 1038.2469 1063.7008 1079.1198 1091.6812 1107.3252 1111.1271 1129.8114 1154.6005 1162.3345 1201.9800 1205.1744 1213.9526 1242.8776 1259.3772 1267.9303 1276.3063 1279.0889 1287.6946 1296.9583 1325.1079 1329.5634 1341.2881 1356.0702 1357.1889 1365.2015 1378.9688 1388.5874 1389.5085 1393.6667 1429.1968 1457.3684 1462.0761 1466.0112 1470.7431 1474.6882 1476.6446 1478.8211 1484.9250 1488.6024 1490.9228 1649.9941 1654.3502 2928.7130 2954.0609 2957.9003 2961.9513 2964.7306 2968.0712 2971.4757 2974.8023 2984.2141 2990.9015 2998.5448 3000.6405 3010.1359 3035.5231 3038.6298 3067.0115 3067.9631 3070.7379 3071.0535 3078.4214 3097.4480 3121.6483 3159.4670 3239.2643
redmass: 3.4532 4.2488 3.7816 4.9636 2.7244 1.6444 3.4599 3.4863 2.5229 2.5033 3.5276 1.6944 3.4709 2.8280 1.1263 1.3502 2.9613 3.3782 2.9302 2.1578 2.6649 3.1956 2.8544 2.9148 3.2571 2.5406 2.2060 3.6826 3.6987 1.5403 1.1014 1.4085 1.5542 3.0001 1.4403 3.2497 1.8246 2.3955 1.4630 1.4398 3.0490 1.5170 1.1922 2.1277 1.7896 2.9404 1.4362 2.6530 2.5928 2.9613 2.4560 2.0802 2.4086 3.6287 1.7798 2.0242 2.4155 1.2417 1.2961 1.3734 1.2066 1.2518 1.2085 1.1704 1.1464 1.0721 1.2893 1.4119 1.4845 1.5097 1.4917 1.3723 1.2446 1.3949 1.2169 1.2193 1.1618 1.1070 1.0774 1.0746 1.0728 1.0707 1.0665 1.0428 1.0751 1.0636 1.0664 1.0631 9.0116 5.0284 1.0546 1.0592 1.0605 1.0807 1.0670 1.0597 1.0364 1.0370 1.1003 1.0758 1.0877 1.0651 1.1005 1.1036 1.0987 1.0992 1.1006 1.0997 1.0995 1.0978 1.0962 1.0585 1.1001 1.1157
irintensity: 0.1850 0.0976 0.3305 0.7923 0.1003 0.1350 2.4683 0.2878 2.5395 0.2283 1.5715 1.5602 6.1371 7.0916 0.1142 0.1191 1.0387 0.1765 7.8565 0.1342 4.2747 2.4010 4.7961 1.3330 4.6559 2.1635 2.2563 8.8555 2.6676 2.6016 9.1346 6.5413 10.1877 9.4891 1.5141 15.8337 6.1915 47.6128 62.9124 2.7463 15.5014 12.9754 35.5043 8.0345 4.5992 27.1111 8.2756 114.7948 0.8346 82.0817 14.0925 13.1084 39.0715 422.1326 10.5778 7.1032 2.8574 9.6084 29.0183 1.3164 1.8554 18.5400 3.5179 6.2487 2.1461 1.3594 7.1291 55.5550 14.0801 3.4130 2.1107 0.1572 16.3229 1.0124 11.9545 17.9619 2.3181 25.4156 8.0733 5.9144 1.4244 4.7607 3.1069 12.4111 18.2491 13.0164 12.7822 3.8496 148.7650 93.3510 36.4108 5.8919 5.8339 3.0081 60.8168 90.2128 37.1946 28.3458 31.2501 17.6286 48.0047 6.8414 22.2466 81.5083 4.5866 50.6495 97.0736 105.2409 12.3351 30.5454 7.0038 0.8764 11.8930 8.1380
temp: 298.150 k
press: 1.00000 atm
elementType: 8 8 8 6 6 6 6 6 6 6 6 6 6 6 6 6 1 1 1 1 1 1 1 1 1 1 1 1 1 1 1 1 1 1 1 1 1 1 1 1
symmnumber: 1
zpe: 911106.2 jmol-1
zpe.correction: 0.347022 hartree
zpe.thermalcorrener: 0.366303 hartree
zpe.thermalcorrenthalpy: 0.367247 hartree
zpe.thermalcorrgfe: 0.297062 hartree
zpe.sumelectzpe: -734.108821 hartree
zpe.sumelectthermal: -734.089541 hartree
zpe.sumelectthermalent: -734.088597 hartree
zpe.sumelectthermalfe: -734.158782 hartree
dipole: -0.3134 0.6001 0.5451
dipole: 0.8692
quadrupole: -97.4422 -94.5130 -103.8794
quadrupole: 2.4072 -4.4431 1.3391
quadrupole: 1.1694 4.0985 -5.2679 2.4072 -4.4431 1.3391
hfenergy: -734.4558434 hartree
pointgroup: C01 [X(C13H24O3)]
dipole: 0.1628516 0.2957505 0.0543513 debye
polarizability: 155.7142919|-0.4865417|159.2407689|-1.8615755|18.1248757|146.4096679 unknown
InChI: InChI=1S/C13H24O3/c1-4-7-8-12(5-2)11-15-10-9-13(14)16-6-3/h6,12H,3-5,7-11H2,1-2H3
charge 0 multiplicity 1
40 atoms
O  0.333408 -1.424797 -1.884556
O  2.945028 0.349476 0.577035
O  2.676382 -1.917153 1.123846
C  -1.711788 -0.486247 -0.932593
C  -2.513373 -0.316628 0.387369
C  -1.591579 0.815442 -1.776269
C  -3.957025 0.199137 0.193195
C  -0.331259 -1.08737 -0.612932
C  -4.770868 0.217081 1.507834
C  -0.951823 2.020991 -1.049485
C  -6.205115 0.756613 1.318385
C  1.599765 -2.132998 -1.727564
C  2.763436 -1.223289 -1.243949
C  2.778626 -1.024688 0.255474
C  3.009011 0.711561 1.95153
C  3.141812 2.010186 2.293389
H  -2.243715 -1.232663 -1.560267
H  -2.555563 -1.299107 0.903582
H  -1.97199 0.367066 1.073706
H  -0.997006 0.575473 -2.677648
H  -2.599942 1.102645 -2.133229
H  -4.478993 -0.437809 -0.551584
H  -3.938859 1.223339 -0.230339
H  -0.435322 -2.007225 0.003984
H  0.284009 -0.359365 -0.041901
H  -4.811606 -0.809464 1.925994
H  -4.236973 0.83644 2.257613
H  0.076755 1.799564 -0.708473
H  -1.54078 2.330536 -0.166019
H  -0.891517 2.890958 -1.729176
H  -6.189847 1.7918 0.927613
H  -6.769694 0.135703 0.597261
H  -6.766257 0.763009 2.270949
H  1.491961 -2.993645 -1.033312
H  1.834737 -2.508634 -2.73721
H  3.716251 -1.720729 -1.514492
H  2.726836 -0.25124 -1.761176
H  2.942096 -0.129575 2.650556
H  3.192599 2.288571 3.349078
H  3.201087 2.80204 1.541075
