program: Gaussian 09
title: 000252926
version: EM64L-G09RevD.01
frameworkgroup: C1[X(C8H9N3O2)]
method: RPBEPBE
basis: SDD
operation: Freq
keyword: #pfreq=noraman
keyword: PBEPBE/SDD
title: #p freq=noraman PBEPBE/SDD
converged: YES YES NO NO
title: Mulliken charges:
elementType: O O N N N C C C C C C C C H H H H H H H H H
charge: -0.187615 -0.278752 -0.425962 0.026755 -0.633296 0.215682 0.293682 -0.348684 -0.249359 -0.464880 0.219067 0.156183 -0.782421 0.229680 0.286977 0.308665 0.234000 0.257911 0.263841 0.212462 0.326022 0.340044
chargesum: 0.00000
title: Mulliken charges with hydrogens summed into heavy atoms:
elementType: O O N N N C C C C C C C C
charge: -0.187615 -0.278752 -0.117297 0.026755 0.032770 0.215682 0.293682 -0.119004 0.037618 -0.230879 0.219067 0.156183 -0.048208
polarizability: 1.95252484e+02 -8.31949607e-01 1.16865202e+02 -1.02071973e+00 -1.02802678e+00 5.33292999e+01
1716.lowfreq: -5.9134 -4.6412 -0.0007 -0.0004 0.0005 4.2914 28.2220 44.4405 46.4021
frequency: 28.0424 44.3397 46.3817 56.3057 103.9939 143.4360 201.5824 274.4121 276.7732 351.4013 402.6945 411.4118 463.7331 483.7344 511.2739 544.5353 578.9404 592.3048 614.3702 623.1311 626.0446 710.2706 744.4901 781.0478 844.8023 859.7585 918.5152 921.6854 986.0529 987.7692 997.1549 1033.6861 1050.2063 1123.4524 1147.5372 1197.0575 1248.6462 1322.9481 1334.3765 1360.3179 1362.2017 1383.6884 1444.4219 1462.5015 1470.0959 1489.0604 1549.3027 1583.3806 1596.6808 1634.6923 1660.3639 2990.4624 3079.2879 3107.3224 3121.3437 3133.9435 3168.1171 3527.0730 3539.7672 3679.5829
redmass: 5.8539 3.8330 1.5370 2.1927 5.3018 4.8345 6.2867 4.8857 4.2722 5.0953 3.7464 3.9050 2.9261 1.6453 1.9316 4.1826 2.1375 1.4907 1.2272 6.0768 4.6251 4.3652 5.4719 4.9776 2.7991 2.0804 2.8881 2.1513 3.7723 1.7189 1.3632 1.6672 1.9471 1.9509 1.5730 2.9181 1.9560 4.2892 2.7526 2.5600 3.1615 1.2161 1.1819 1.7865 1.2192 2.1049 4.3521 2.4759 4.9400 1.9219 6.4696 1.0375 1.0987 1.0910 1.0984 1.0905 1.0963 1.0450 1.0764 1.1042
irintensity: 6.9279 16.5516 5.5214 0.7403 7.8198 0.4446 7.0099 0.5073 0.4250 7.4379 3.7056 5.0004 10.3481 34.7841 129.6636 16.0946 50.3469 60.6128 79.6908 5.7322 13.3447 49.7226 4.8138 21.7319 16.2120 33.1408 1.6308 9.4089 2.1749 41.1744 2.9501 22.0476 2.4818 3.3033 45.0794 203.5214 1.1204 195.6076 19.1870 45.6070 361.2041 73.4695 161.2192 351.7266 80.3847 0.6775 90.9354 249.2051 46.7316 270.7083 149.7660 10.6710 17.8372 32.2167 9.6459 10.5888 3.6826 47.1564 17.8593 32.7830
temp: 298.150 k
press: 1.00000 atm
elementType: 8 8 7 7 7 6 6 6 6 6 6 6 6 1 1 1 1 1 1 1 1 1
symmnumber: 1
zpe: 436229.7 jmol-1
zpe.correction: 0.166151 hartree
zpe.thermalcorrener: 0.178718 hartree
zpe.thermalcorrenthalpy: 0.179662 hartree
zpe.thermalcorrgfe: 0.125059 hartree
zpe.sumelectzpe: -624.034871 hartree
zpe.sumelectthermal: -624.022304 hartree
zpe.sumelectthermalent: -624.021360 hartree
zpe.sumelectthermalfe: -624.075963 hartree
dipole: -1.6563 1.7944 0.1509
dipole: 2.4467
quadrupole: -71.8463 -70.6421 -77.9895
quadrupole: -29.2568 -4.0380 -1.1535
quadrupole: 1.6463 2.8505 -4.4968 -29.2568 -4.0380 -1.1535
hfenergy: -624.2010223 hartree
pointgroup: C01 [X(C8H9N3O2)]
dipole: -0.631997 -0.7251732 -0.0357698 debye
dipolederiv: -0.6534208 -0.0201392 -0.0225996 0.5316536 -0.8648995 -0.1577493 0.0461523 -0.1420226 -0.3535878 -1.0422766 0.2562342 0.0168445 0.1537878 -0.817386 -0.0377546 -0.0171699 -0.0250161 -0.3777946 -2.3505282 0.2837694 0.0815304 0.4387752 -0.4153187 -0.0388281 0.0601323 -0.0530264 -0.3937387 -0.7730685 -0.0708987 -0.0004423 -0.553124 -0.3185081 0.0347147 0.0416857 0.0463066 -0.2150403 -0.6240634 -0.3939749 -0.0445233 -0.4856795 -1.0056707 0.0074341 -0.052778 0.023424 -0.6942081 1.9261311 0.0357029 -0.0450736 0.3544243 0.1811262 -0.0708926 0.0284091 -0.0477818 0.1878569 -0.7752054 -0.0286353 0.0001075 -0.2058479 -0.25969 0.048856 0.0090567 0.0494098 0.0157771 -0.696906 0.0230092 0.0091908 0.3591386 0.0175809 -0.032569 -0.0175665 -0.0373261 -0.170239 0.3578664 0.006875 -0.0029142 0.2155069 0.1523221 -0.0458817 0.0082128 -0.0307646 -0.0703848 0.4517454 -0.0121278 0.01662 0.0987737 0.2890567 -0.0848956 -0.0810754 -0.0800454 -0.0460642 1.9884707 -0.1887356 -0.0052352 -1.0743037 1.1870378 0.2838058 0.041099 0.2434688 0.2752022 1.8027029 0.1571602 -0.0043283 0.3367347 1.4559688 0.0834846 0.0385405 0.0482164 0.2518881 -0.4726238 -0.1282309 -0.0526981 -0.1271559 -0.007094 -0.0504147 -0.1705056 -0.0787125 -0.0152804 0.0346177 -0.0903065 0.0100832 -0.0927211 -0.0609519 0.0454631 0.0087387 0.0443296 0.1604839 0.1038866 0.0825894 -0.0168609 0.0417184 0.0642275 0.0199075 -0.026424 0.0048508 0.1458706 0.1606517 0.016387 0.0097214 0.0299707 0.0955325 -0.0156303 -0.0779056 0.0075784 0.3173038 0.0291467 -0.0909875 0.0156154 -0.1234195 -0.0741774 0.0374111 0.0511241 0.0289958 0.1130196 0.0648528 -0.0141303 -0.0277909 -0.0230742 0.0979862 0.0387634 -0.0618344 0.0267402 -0.0608064 0.0172038 0.026027 0.0628992 0.0524466 0.0633579 -0.0721265 0.1242149 -0.0449687 0.0570346 0.0597824 0.0425155 -0.0211992 -0.0436633 -0.149088 0.0431199 0.0081295 0.0482912 0.1125067 0.193196 0.0795437 0.0161239 0.0973265 0.1803638 -0.0205064 0.0245336 -0.0206445 0.3771347 0.1978386 0.0283534 0.0049293 0.018732 0.1882241 -0.0157113 0.0152305 -0.011303 0.3830663 unknown
polarizability: 195.1434594|3.0329181|116.9063649|-0.9505746|-2.3531704|53.3971622 unknown
InChI: InChI=1S/C8H9N3O2/c1-5(12)11-7-3-2-6(4-10-7)8(9)13/h2-4,11H,9H2,1H3
charge 0 multiplicity 1
22 atoms
O  -3.247786 1.449202 0.416561
O  4.115711 -0.788081 -0.077909
N  -2.326168 -0.686092 -0.017515
N  -0.480235 0.812055 -0.27271
N  3.77213 1.501792 0.019216
C  -0.932575 -0.44849 -0.025315
C  1.822427 -0.007321 -0.036919
C  -0.053389 -1.552744 0.188744
C  1.32877 -1.322853 0.174553
C  0.865049 1.011846 -0.268197
C  -3.392739 0.234291 0.143343
C  3.312304 0.195701 -0.035811
C  -4.767794 -0.405689 -0.068065
H  -0.451477 -2.557024 0.37211
H  2.051561 -2.130391 0.327062
H  -2.598124 -1.668619 -0.093725
H  1.164615 2.042266 -0.499597
H  -5.088108 -0.237294 -1.112849
H  -5.495871 0.093313 0.589808
H  -4.788422 -1.493088 0.12691
H  3.158575 2.305013 0.137165
H  4.78085 1.647806 0.005942
