program: Gaussian 09
title: 000260987
version: EM64L-G09RevD.01
frameworkgroup: C1[X(C28H22O)]
method: RPBEPBE
basis: SDD
operation: Freq
keyword: #pfreq=noraman
keyword: PBEPBE/SDD
title: #p freq=noraman PBEPBE/SDD
converged: YES YES NO NO
title: Mulliken charges:
elementType: O C C C C C C C C C C C C C C C C C C C C C C C C C C C C H H H H H H H H H H H H H H H H H H H H H H
charge: -0.307275 -0.010204 0.449111 0.313176 0.353041 0.202273 -0.558581 0.441060 -0.435366 0.185557 -0.506192 0.418387 -0.331191 -0.371529 -0.406856 -0.402014 -0.476933 -0.482593 -0.372674 -0.537035 -0.436821 -0.255961 -0.239781 -0.226822 -0.256488 -0.265144 -0.246551 -0.245541 -0.248100 0.252232 0.275169 0.239940 0.234785 0.262543 0.287817 0.259766 0.239165 0.235157 0.236657 0.218541 0.227672 0.235996 0.239343 0.224811 0.225092 0.223551 0.226364 0.229055 0.225716 0.228716 0.228958
chargesum: 0.00000
title: Mulliken charges with hydrogens summed into heavy atoms:
elementType: O C C C C C C C C C C C C C C C C C C C C C C C C C C C C
charge: -0.307275 -0.010204 0.449111 0.313176 0.353041 0.202273 -0.306349 0.441060 -0.160197 0.185557 -0.266252 0.418387 -0.096407 -0.108986 -0.119039 -0.142248 -0.237768 -0.247437 -0.136017 0.145175 -0.197478 -0.031150 -0.014689 -0.003271 -0.030125 -0.036089 -0.020835 -0.016825 -0.019142
polarizability: 4.14575090e+02 -3.39292563e+01 3.24117289e+02 1.37464756e+01 1.77336879e+01 2.04785046e+02
1716.lowfreq: -5.9244 -3.5777 -0.0006 0.0002 0.0004 2.8610 15.1062 24.9383 43.6618
frequency: 14.0616 24.9187 43.6533 51.0034 57.0170 77.4042 100.0109 120.5125 131.8696 133.8934 168.6250 184.9228 213.4576 223.3008 241.3427 251.2999 262.0651 268.6519 302.0211 326.4254 336.1107 368.5173 400.2746 409.2613 413.6268 417.1500 431.1278 462.6243 478.2037 488.3444 505.2550 528.0655 533.6252 565.5434 584.5431 616.3978 617.0178 622.3268 640.0735 655.4306 665.3220 702.1512 710.5469 715.0695 724.6382 734.9724 755.2123 759.7533 770.3624 805.6735 818.4638 831.5945 854.3501 861.6665 869.1126 869.8966 889.0106 892.4308 911.8272 920.6057 928.0080 941.9634 952.4100 958.9761 978.8207 981.2371 988.0612 989.8601 991.1732 992.8705 996.7524 998.8610 1002.5893 1016.4965 1023.7628 1029.1450 1031.5391 1041.6254 1079.8592 1090.1107 1097.5705 1118.9454 1140.9580 1152.5070 1158.1466 1170.8751 1171.3066 1172.5288 1178.2380 1186.0555 1191.6176 1200.0972 1214.9714 1231.2659 1236.6183 1257.8831 1286.4404 1308.7517 1313.0822 1319.6839 1374.4831 1380.9739 1386.8084 1395.5139 1409.6114 1425.3045 1430.3775 1431.7691 1436.3076 1448.1176 1451.6628 1460.4866 1476.0357 1479.5614 1481.4273 1510.3195 1518.8465 1570.6446 1587.6427 1590.9153 1607.5625 1609.5939 1611.4146 1626.0778 1627.7496 2957.2074 3045.6308 3100.7719 3117.6839 3120.6940 3121.2721 3121.4905 3122.7517 3128.6969 3130.9508 3134.1085 3141.2961 3143.1152 3144.2034 3149.3694 3151.5913 3154.1666 3159.4856 3161.0668 3163.8933 3167.6896 3183.6342
redmass: 4.5390 4.5622 4.6669 5.0229 4.4921 3.9732 4.5305 3.5645 4.1578 4.5790 4.1488 2.3036 2.0582 2.7243 4.8742 4.1133 4.2385 3.7274 3.9344 5.0432 4.9127 4.4366 2.8453 4.1652 3.9592 3.3068 3.0554 4.5949 3.6426 4.0877 5.4595 3.9155 3.5747 3.2734 5.1439 6.4271 6.3992 6.9053 5.7641 4.5097 5.5309 1.8891 5.6720 1.8096 4.9926 2.4735 1.7400 1.3741 2.1065 2.1534 1.4434 5.0707 1.2577 1.5579 2.0770 2.1041 1.8327 2.6651 2.5590 2.2929 2.3140 2.1624 2.0954 1.3744 1.3607 1.3791 1.3872 6.1382 4.4904 1.4221 1.3557 1.3241 1.3336 8.3398 3.9403 2.1740 2.2391 2.1043 1.5842 1.6266 2.2831 1.2667 2.1337 1.5413 1.5096 1.1256 1.0876 1.1852 1.0922 1.1938 1.1422 2.6363 3.0512 1.8134 2.4877 1.5854 1.6058 1.5674 1.5938 1.4261 7.0942 8.8729 4.2558 4.4727 2.5091 2.9785 1.4116 1.8492 1.9805 2.6881 2.9089 1.0566 2.1759 1.7294 1.2151 3.5327 3.6683 7.3508 6.2094 6.2916 6.0691 5.7087 6.0381 6.7125 6.6041 1.0323 1.1020 1.1003 1.0862 1.0847 1.0864 1.0845 1.0880 1.0877 1.0885 1.0886 1.0930 1.0983 1.0939 1.0940 1.0949 1.0948 1.0995 1.0940 1.1009 1.0954 1.0941
irintensity: 0.0181 0.0574 0.0955 0.2638 0.3796 0.4986 0.2936 2.1077 1.2251 2.2666 0.5531 1.4002 2.3559 2.1693 0.3210 0.7109 5.0101 2.8906 6.2008 0.1566 10.7571 0.6348 0.3051 0.8221 0.9590 0.2158 8.3785 3.0778 5.4063 6.6098 0.4913 2.2682 2.9050 2.3144 26.3084 0.0571 0.5642 5.7651 7.5159 5.7991 19.0550 35.8446 3.3269 69.0417 10.2045 2.2685 43.1502 62.8117 48.0926 0.0486 7.3685 8.1600 0.2784 55.0103 14.2746 18.3514 16.0280 1.6257 6.8984 23.3215 2.5750 3.7173 3.7577 3.3642 0.9214 0.3616 0.6837 0.8195 1.6224 0.8319 0.3374 0.3072 1.6415 87.2293 18.6103 6.3307 4.9151 8.8509 1.0406 11.9362 6.9141 0.1870 4.9351 2.3552 1.2979 1.6875 1.1820 0.4609 2.7119 9.5702 9.4380 12.4351 41.1134 4.7017 0.2630 38.2802 3.3202 1.1249 0.6864 4.7022 1.6303 0.4499 5.1857 1.6692 0.4798 6.0119 3.2453 3.6617 21.7059 7.4128 5.3899 1.4418 24.5897 19.7715 13.2963 11.0404 6.3926 0.2469 0.4196 1.2277 8.6545 8.8546 1.6445 1.2188 0.0488 59.6241 49.5108 29.1078 0.4935 4.4216 4.0857 1.3251 9.1380 4.9520 11.2164 5.5168 31.7173 38.7099 32.1661 32.3364 18.3972 14.6445 25.0652 14.4378 31.3043 19.2342 6.0328
temp: 298.150 k
press: 1.00000 atm
elementType: 8 6 6 6 6 6 6 6 6 6 6 6 6 6 6 6 6 6 6 6 6 6 6 6 6 6 6 6 6 1 1 1 1 1 1 1 1 1 1 1 1 1 1 1 1 1 1 1 1 1 1
symmnumber: 1
zpe: 1074272.1 jmol-1
zpe.correction: 0.409169 hartree
zpe.thermalcorrener: 0.432283 hartree
zpe.thermalcorrenthalpy: 0.433228 hartree
zpe.thermalcorrgfe: 0.355698 hartree
zpe.sumelectzpe: -1153.439987 hartree
zpe.sumelectthermal: -1153.416872 hartree
zpe.sumelectthermalent: -1153.415928 hartree
zpe.sumelectthermalfe: -1153.493458 hartree
dipole: -0.2982 -1.2233 -0.2703
dipole: 1.2878
quadrupole: -153.6565 -152.2570 -165.2575
quadrupole: -3.8708 2.4753 1.1623
quadrupole: 3.4005 4.8000 -8.2005 -3.8708 2.4753 1.1623
hfenergy: -1153.8491556 hartree
pointgroup: C01 [X(C28H22O1)]
dipole: 0.1185213 0.4820247 -0.101526 debye
polarizability: 413.9477196|-34.3335016|324.8562028|-16.3861704|-15.8212387|204.6735026 unknown
InChI: InChI=1S/C28H22O/c1-29-28(23-11-4-2-5-12-23,24-13-6-3-7-14-24)25-19-18-22-17-16-21-10-8-9-15-26(21)27(22)20-25/h2-20H,1H3
charge 0 multiplicity 1
51 atoms
O  -1.840636 -0.0572 2.111287
C  -1.709397 0.022447 0.623108
C  -0.393253 0.756332 0.283344
C  -1.68585 -1.457067 0.161032
C  -2.982531 0.675404 0.024792
C  2.075255 0.678024 0.033645
C  0.815192 0.040089 0.228798
C  2.099301 2.113949 -0.10039
C  -0.347566 2.181047 0.163589
C  3.338264 -0.065989 -0.031631
C  0.871041 2.837711 -0.028084
C  4.570633 0.659849 -0.227743
C  -1.552083 -1.762384 -1.217757
C  -4.215165 0.522799 0.708774
C  -1.813473 -2.518454 1.087413
C  -2.984349 1.31884 -1.238798
C  3.355683 2.800629 -0.299255
C  4.544575 2.100473 -0.35958
C  3.409314 -1.488222 0.090156
C  -1.793572 1.215912 2.835358
C  5.809712 -0.049894 -0.291083
C  -1.54633 -3.101221 -1.661517
C  -5.415401 1.018448 0.156544
C  -1.811692 -3.861471 0.642287
C  -4.185614 1.811453 -1.79624
C  4.635285 -2.165185 0.025401
C  -1.679132 -4.160144 -0.73194
C  -5.407034 1.667016 -1.100276
C  5.848355 -1.44343 -0.166197
H  0.771408 -1.046299 0.341797
H  -1.274063 2.760961 0.221651
H  0.896678 3.930067 -0.120388
H  -1.449289 -0.953407 -1.949466
H  -4.219078 0.003082 1.672816
H  -1.907946 -2.28209 2.149562
H  -2.047231 1.441259 -1.793068
H  3.34407 3.892426 -0.399127
H  5.495215 2.626209 -0.508938
H  2.495374 -2.071747 0.236005
H  -2.550232 1.932859 2.458933
H  -2.022778 0.956939 3.881596
H  -0.790832 1.679456 2.779884
H  6.735598 0.518679 -0.439942
H  -1.441206 -3.317816 -2.730636
H  -6.357461 0.891832 0.702138
H  -1.912504 -4.672881 1.372416
H  -4.165799 2.306159 -2.774051
H  4.660066 -3.256137 0.121898
H  -1.679502 -5.200704 -1.075953
H  -6.338511 2.049584 -1.532437
H  6.802688 -1.978899 -0.215727
