program: Gaussian 09
title: 000252910
version: EM64L-G09RevD.01
frameworkgroup: C1[X(C15H13N3O)]
method: RPBEPBE
basis: SDD
operation: Freq
keyword: #p
keyword: freq=noraman
keyword: PBEPBE/SDD
title: #p freq=noraman PBEPBE/SDD
converged: YES YES NO NO
title: Mulliken charges:
elementType: O N N N C C C C C C C C C C C C C C C H H H H H H H H H H H H H
charge: -0.253747 -0.368228 -0.220291 -0.305973 0.283923 0.216752 -0.013884 0.185515 0.536568 -0.350278 -0.289413 -0.655470 -0.226978 -0.282416 -0.322418 -0.322953 -0.222249 -0.222123 -0.236089 0.253662 0.210224 0.291470 0.235129 0.235128 0.233524 0.235765 0.236189 0.236181 0.227952 0.224325 0.224328 0.225878
chargesum: 0.00000
title: Mulliken charges with hydrogens summed into heavy atoms:
elementType: O N N N C C C C C C C C C C C C C C C
charge: -0.253747 -0.368228 -0.220291 -0.078021 0.283923 0.216752 -0.013884 0.185515 0.536568 -0.096616 -0.079189 0.106257 0.006546 -0.046651 -0.086229 -0.086772 0.002076 0.002204 -0.010211
polarizability: 2.67825472e+02 2.54048643e+00 1.73427266e+02 -1.26151153e-01 6.31920079e-02 1.16546607e+02
1716.lowfreq: -8.3901 -7.7846 0.0002 0.0003 0.0006 9.7938 20.4106 28.6735 66.2825
frequency: 20.3234 28.5006 66.2710 70.5551 113.0217 130.8496 185.7045 232.4354 242.1665 256.3455 302.3431 307.9739 369.6103 405.5944 407.2386 410.2782 429.3277 446.6193 478.9937 501.1220 531.4961 545.2686 612.6535 645.9793 655.0708 661.0552 667.8852 694.7517 709.7784 733.6210 756.7703 765.3460 788.0248 815.4264 840.3096 854.3502 861.5449 915.6260 939.7099 946.9839 969.8686 984.0358 990.4312 991.5876 1022.1295 1043.1326 1054.2021 1077.1905 1092.8641 1127.2565 1129.9567 1148.1746 1170.9503 1177.3450 1180.9700 1185.7438 1234.7407 1275.3640 1299.6611 1308.7655 1326.8764 1365.8009 1383.3600 1394.7744 1428.3286 1438.1884 1458.8504 1481.0865 1483.8785 1495.4233 1499.7867 1563.2415 1594.5353 1604.0923 1607.5764 1614.3307 1632.0460 2986.1537 3069.4259 3124.5277 3127.1888 3129.2363 3137.5138 3142.0701 3149.7695 3159.1656 3166.8114 3169.7782 3182.6162 3388.6403
redmass: 3.8013 5.6472 5.2121 5.2847 3.3786 6.1999 4.5855 6.3369 1.1378 4.3890 4.2318 3.5709 3.7585 4.3498 2.8642 6.6719 7.3747 3.9397 6.1697 3.6470 3.6696 7.8070 6.3928 5.1201 4.6813 5.6884 5.9444 1.7950 8.7398 2.0365 1.9153 1.3259 1.7748 4.6163 1.2515 3.9532 1.4805 1.5601 3.0414 1.3856 1.3900 1.3244 3.9999 1.5026 2.3259 2.3399 3.5349 1.5210 1.8908 1.2957 1.9924 1.9522 1.0529 1.2249 1.1352 2.9829 2.2273 3.3002 2.2286 1.3141 3.2097 3.2086 10.0822 7.7410 1.2871 2.2203 2.2441 2.4375 1.5778 1.7999 1.0442 7.2101 7.4786 6.7604 7.4138 7.4355 7.2861 1.0357 1.1027 1.0880 1.0847 1.0976 1.0885 1.0887 1.0930 1.0972 1.0957 1.1016 1.0964 1.0761
irintensity: 0.0014 1.0549 2.2905 2.6688 1.2224 1.4067 0.8693 3.8669 0.1521 0.2500 3.3199 0.4381 11.5697 0.1997 0.0186 10.5062 7.4707 0.2135 10.9712 3.7992 6.6947 8.6067 0.2914 28.4338 12.8000 6.8252 14.8836 47.8104 11.4245 0.0231 42.6683 110.2018 33.1883 17.7523 0.0086 7.4519 0.3673 3.5289 50.9498 1.6899 0.0124 0.0527 3.8464 1.2057 8.7833 16.0671 15.0635 11.7401 83.8930 0.0916 52.6651 18.3022 0.0006 6.3484 0.3045 21.0080 9.4241 82.7200 29.4145 0.0121 65.9776 245.8021 1.8218 15.0692 48.0154 5.7561 58.0778 28.3826 148.5951 6.1499 17.5868 175.2190 81.8694 2.4951 162.9671 360.9325 9.1942 54.6860 25.3986 5.1249 0.2171 0.7105 5.5687 7.5204 34.7581 27.0346 23.6305 11.7764 12.0498 20.7643
temp: 298.150 k
press: 1.00000 atm
elementType: 8 7 7 7 6 6 6 6 6 6 6 6 6 6 6 6 6 6 6 1 1 1 1 1 1 1 1 1 1 1 1 1
symmnumber: 1
zpe: 652660.8 jmol-1
zpe.correction: 0.248585 hartree
zpe.thermalcorrener: 0.263987 hartree
zpe.thermalcorrenthalpy: 0.264931 hartree
zpe.thermalcorrgfe: 0.204480 hartree
zpe.sumelectzpe: -817.572147 hartree
zpe.sumelectthermal: -817.556745 hartree
zpe.sumelectthermalent: -817.555801 hartree
zpe.sumelectthermalfe: -817.616253 hartree
dipole: -4.3267 -0.4449 0.0064
dipole: 4.3495
quadrupole: -90.1203 -110.2766 -106.9404
quadrupole: -3.6571 -0.0010 -0.0126
quadrupole: 12.3254 -7.8308 -4.4946 -3.6571 -0.0010 -0.0126
hfenergy: -817.8207324 hartree
pointgroup: C01 [X(C15H13N3O1)]
dipole: 1.7041729 0.1553367 -0.0027866 debye
polarizability: 267.8712258|1.4477542|173.3779465|-0.2667112|-0.4339994|116.5501729 unknown
InChI: InChI=1S/C15H13N3O/c1-17-13-10-6-5-9-12(13)14(16)18(15(17)19)11-7-3-2-4-8-11/h2-10,16H,1H3
charge 0 multiplicity 1
32 atoms
O  -0.850082 -2.391816 0.014706
N  -0.540075 -0.074336 -0.001161
N  1.342125 -1.568478 0.002431
N  -0.364261 2.255181 -0.025276
C  2.239976 -0.481919 -0.004728
C  1.736538 0.854811 -0.012685
C  0.26824 1.104795 -0.014108
C  -0.065506 -1.403153 0.0059
C  -1.993822 0.087902 0.003032
C  3.646395 -0.700755 -0.004361
C  2.655755 1.932994 -0.018913
C  1.846995 -2.954968 0.008813
C  4.5358 0.388747 -0.011113
C  4.045083 1.716631 -0.01826
C  -2.688748 0.15655 -1.220815
C  -2.679481 0.169385 1.231321
C  -4.092549 0.307633 -1.214419
C  -4.083318 0.320442 1.233992
C  -4.791857 0.389916 0.012056
H  4.045446 -1.717463 0.001356
H  2.275151 2.961154 -0.024173
H  0.973586 -3.62243 0.012814
H  2.455277 -3.146536 0.911124
H  2.453956 -3.154973 -0.89252
H  5.614995 0.201484 -0.01064
H  4.736389 2.564695 -0.023063
H  -2.135293 0.094884 -2.163512
H  -2.118919 0.117427 2.17041
H  0.276343 3.069625 -0.034435
H  -4.638163 0.360427 -2.162931
H  -4.621752 0.383082 2.186004
H  -5.881422 0.506361 0.015552
