program: Gaussian 09
title: 000252907
version: EM64L-G09RevD.01
frameworkgroup: C1[X(C16H15N3S)]
method: RPBEPBE
basis: SDD
operation: Freq
keyword: #p
keyword: freq=noraman
keyword: PBEPBE/SDD
title: #p freq=noraman PBEPBE/SDD
converged: YES YES NO NO
title: Mulliken charges:
elementType: S N N N C C C C C C C C C C C C C C C C H H H H H H H H H H H H H H H
charge: 0.250914 -0.279103 0.012561 -0.056784 0.211292 0.054770 0.070409 0.429442 -0.307831 -0.300515 -0.369869 -0.314277 -0.307463 -0.294766 -0.207094 -0.214494 -0.215707 -0.236261 -0.720639 -0.810738 0.246039 0.254602 0.244437 0.245478 0.228714 0.231621 0.226701 0.226665 0.227556 0.242479 0.215565 0.216768 0.281644 0.281208 0.236676
chargesum: 0.00000
title: Mulliken charges with hydrogens summed into heavy atoms:
elementType: S N N N C C C C C C C C C C C C C C C C
charge: 0.250914 -0.279103 0.012561 -0.056784 0.211292 0.054770 0.070409 0.429442 -0.307831 -0.054477 -0.115267 -0.069840 -0.061985 -0.066052 0.024527 0.012206 0.010959 -0.008704 -0.045827 -0.011210
polarizability: 3.07867143e+02 4.83362526e+00 2.32650652e+02 2.08438352e+00 -1.16593338e+00 1.27655149e+02
1716.lowfreq: -8.6051 -6.7121 -0.0010 0.0011 0.0021 1.7655 15.6873 39.3678 53.3735
frequency: 15.1194 39.2525 53.3420 64.5689 66.2064 94.2995 116.3479 141.1602 156.2625 210.4694 219.4710 243.6972 253.6505 264.4722 281.0084 282.4638 327.0246 353.2460 406.1003 407.9573 460.2534 468.2023 508.1678 529.7725 552.5580 586.2668 610.3852 622.8494 637.8339 659.4188 665.8219 677.5954 695.6493 749.4667 770.0969 777.4628 789.7620 841.6535 844.7991 878.0592 904.9506 922.3997 953.9994 974.0425 980.7406 986.7950 990.5698 990.6565 993.9593 1002.8819 1019.9915 1029.5712 1059.4502 1063.4911 1076.1701 1104.8891 1142.9681 1167.9887 1171.4362 1177.0832 1208.3267 1214.7632 1242.3664 1286.0441 1306.8012 1311.8144 1338.5559 1369.7106 1381.2403 1411.8292 1429.4495 1436.9280 1443.4183 1450.2687 1457.6909 1474.2160 1478.2333 1494.8160 1529.6879 1563.9404 1598.1669 1607.5694 1610.7796 1631.3693 2915.5013 2988.8321 3024.3352 3055.1230 3128.5460 3133.7123 3139.1416 3149.3488 3151.7873 3152.4478 3161.3167 3162.1894 3169.5607 3171.0911 3211.2454
redmass: 4.1898 3.8029 4.0768 4.8812 3.7006 2.1099 1.4760 4.0504 5.0840 3.3201 4.0108 4.3259 3.1349 1.5135 5.2769 3.8185 4.4601 8.9849 4.4513 2.8174 4.2588 4.5927 5.9128 3.9073 7.0107 8.2918 6.7104 7.0253 5.4879 7.0758 5.4485 6.2084 1.8637 2.4203 1.4246 3.5230 3.6347 5.8695 1.2491 1.5174 7.1847 1.4573 1.3856 1.3743 1.1876 1.6270 3.2136 1.3431 1.3531 5.6095 2.6451 2.3104 2.1229 1.3488 1.5235 2.1193 1.6736 1.2235 1.0546 1.1157 2.1033 4.4539 4.4758 1.7052 1.3258 4.4368 1.1465 10.0542 9.8319 1.1680 1.0539 2.2018 1.8230 1.2734 2.2821 1.1614 2.3808 1.0499 9.4180 6.4309 6.6163 6.2996 6.6192 8.6605 1.0384 1.0985 1.0283 1.0938 1.0848 1.0862 1.0887 1.1037 1.0931 1.0921 1.0970 1.1058 1.0982 1.1014 1.0922
irintensity: 0.3366 0.1235 0.0943 1.6891 4.0853 0.0225 0.0458 0.6092 0.5382 2.4885 5.0279 0.9078 1.8020 1.5882 2.4159 0.0406 8.5914 8.7308 0.1163 0.0020 1.4818 10.4613 4.9947 4.8823 8.4147 7.7613 0.0049 4.8511 8.1502 3.5105 11.9287 1.5973 40.9581 44.4801 73.4735 2.5314 1.6470 1.3217 0.0137 2.7005 9.1058 0.3562 1.4668 0.0689 5.1902 8.2189 0.1211 0.4892 0.3991 14.1766 10.2319 15.9004 9.8832 1.6579 11.2353 4.8192 42.4545 2.4395 0.0068 1.8950 3.8060 77.3356 111.8544 16.4141 0.1695 134.5222 10.1553 6.1575 1.9466 35.8225 13.4899 7.1329 33.2036 6.5998 117.4517 18.7048 45.0333 11.0188 617.2650 31.3360 2.3408 2.8446 66.8772 220.0780 96.7850 41.3828 25.0700 52.6387 0.1530 4.6371 7.4503 8.5365 34.0344 16.3546 19.8305 9.7276 21.9272 11.3171 11.6855
temp: 298.150 k
press: 1.00000 atm
elementType: 16 7 7 7 6 6 6 6 6 6 6 6 6 6 6 6 6 6 6 6 1 1 1 1 1 1 1 1 1 1 1 1 1 1 1
symmnumber: 1
zpe: 711947.9 jmol-1
zpe.correction: 0.271167 hartree
zpe.thermalcorrener: 0.289305 hartree
zpe.thermalcorrenthalpy: 0.290250 hartree
zpe.thermalcorrgfe: 0.223249 hartree
zpe.sumelectzpe: -1179.598707 hartree
zpe.sumelectthermal: -1179.580568 hartree
zpe.sumelectthermalent: -1179.579624 hartree
zpe.sumelectthermalfe: -1179.646624 hartree
dipole: 0.6145 -0.2576 0.1248
dipole: 0.6779
quadrupole: -108.1009 -114.1330 -121.8061
quadrupole: -2.1568 0.3939 -0.4588
quadrupole: 6.5791 0.5470 -7.1261 -2.1568 0.3939 -0.4588
hfenergy: -1179.8698737 hartree
pointgroup: C01 [X(C16H15N3S1)]
dipole: 0.2494808 -0.0771785 0.0541569 debye
polarizability: 306.6013359|10.9321035|233.0663962|0.3015987|-9.6270276|128.5052127 unknown
InChI: InChI=1S/C16H15N3S/c1-17-15-13-10-6-7-11-14(13)18-16(20-2)19(15)12-8-4-3-5-9-12/h3-11H,1-2H3
charge 0 multiplicity 1
35 atoms
S  -1.705096 2.447128 -0.388596
N  -0.517823 -0.01395 -0.17092
N  0.967354 1.864507 -0.383644
N  0.100172 -2.245276 -0.109447
C  1.913163 -0.431962 -0.140527
C  0.542214 -1.017623 -0.134645
C  2.065563 0.99297 -0.285078
C  -1.898274 -0.481053 -0.100872
C  -0.240979 1.345036 -0.310307
C  3.091348 -1.220825 -0.004912
C  3.363863 1.570543 -0.319335
C  -2.52135 -0.61569 1.158348
C  -2.603227 -0.763802 -1.290532
C  4.370852 -0.634971 -0.031434
C  4.508482 0.766778 -0.196692
C  -3.867363 -1.036216 1.226911
C  -3.949324 -1.182953 -1.21715
C  -4.583148 -1.319551 0.040148
C  0.912947 -3.460659 -0.093259
C  -0.81115 4.095324 -0.547441
H  3.018356 -2.299152 0.132142
H  3.431959 2.656372 -0.435855
H  -1.952534 -0.397907 2.068049
H  -2.097269 -0.661468 -2.255774
H  5.25884 -1.266578 0.076873
H  5.504266 1.222763 -0.222048
H  -4.355513 -1.141322 2.20194
H  -4.501175 -1.403272 -2.137463
H  -5.628038 -1.644979 0.094508
H  0.236507 -4.327437 -0.188806
H  1.474358 -3.58821 0.857476
H  1.645531 -3.514982 -0.927521
H  -0.201613 4.098161 -1.46098
H  -0.16828 4.252322 0.329054
H  -1.612621 4.849533 -0.597413
