program: Gaussian 09
title: 000260957
version: EM64L-G09RevD.01
frameworkgroup: C1[X(C12H24N3O3P)]
method: RPBEPBE
basis: SDD
operation: Freq
keyword: #p
keyword: freq=noraman
keyword: PBEPBE/SDD
title: #p freq=noraman PBEPBE/SDD
converged: NO YES NO NO
title: Mulliken charges:
elementType: P O O O N N N C C C C C C C C C C C C H H H H H H H H H H H H H H H H H H H H H H H H
charge: 0.998074 -0.252256 -0.246931 -0.249822 -0.552635 -0.512568 -0.537093 -0.289681 -0.345362 -0.339401 -0.342355 -0.323927 -0.279143 -0.319869 -0.276584 -0.297532 -0.295264 -0.283359 -0.317864 0.218688 0.233700 0.215861 0.220701 0.231148 0.214065 0.214428 0.230310 0.209106 0.212231 0.230501 0.212166 0.187656 0.221739 0.193705 0.215629 0.215368 0.185022 0.184589 0.215057 0.187666 0.214666 0.217342 0.182228
chargesum: 0.00000
title: Mulliken charges with hydrogens summed into heavy atoms:
elementType: P O O O N N N C C C C C C C C C C C C
charge: 0.998074 -0.252256 -0.246931 -0.249822 -0.552635 -0.512568 -0.537093 0.162707 0.091200 0.105811 0.102383 0.097410 0.163524 0.089527 0.132749 0.102858 0.104382 0.118974 0.081707
polarizability: 2.01415635e+02 1.43180544e+00 1.90902179e+02 -1.67704188e+00 5.41172424e+00 1.51036840e+02
1716.lowfreq: -10.3045 -0.0017 -0.0012 0.0011 6.1742 8.7237 29.1705 39.5908 49.2151
frequency: 27.3070 39.5415 48.9756 54.1835 66.5146 76.8100 103.6798 129.5616 154.4973 188.2992 203.0196 223.6119 226.4221 262.9372 274.5277 282.4725 292.8847 304.1529 318.5792 378.5101 400.8054 405.0716 410.6433 457.6730 461.5286 467.2965 475.7101 538.2613 550.4772 557.4844 625.8328 639.2638 648.1730 775.9123 792.8933 793.5221 838.5519 840.2717 843.5444 885.2739 895.3213 896.5720 899.9133 913.0132 928.6980 1015.5088 1016.4852 1023.6659 1040.1637 1046.2588 1048.9133 1051.0440 1051.2933 1065.1763 1070.4326 1071.7277 1073.2724 1092.0290 1101.8111 1109.3814 1140.3064 1157.3746 1164.4107 1182.1212 1189.1201 1196.6930 1225.3439 1231.4717 1239.4980 1244.0730 1265.6118 1269.3853 1271.7395 1282.7103 1299.0230 1319.9742 1323.2506 1328.3548 1337.5777 1338.8766 1350.0280 1352.6935 1354.8759 1359.6974 1364.1496 1364.9130 1367.4222 1438.9030 1441.1677 1446.2666 1447.2167 1447.8875 1452.8724 1457.9918 1463.7901 1467.1110 1470.2142 1482.1286 1486.8465 2901.6056 2904.6262 2917.5760 2919.9050 2928.0779 2936.5287 2940.4893 2942.2551 2947.2326 2949.3190 2955.3945 2967.5493 3013.4675 3021.1151 3031.6388 3043.9367 3044.5185 3057.2337 3057.3767 3060.7541 3072.9392 3074.6073 3077.2243 3077.4987
redmass: 5.3255 3.2635 4.8189 3.9579 3.0450 3.7644 3.6267 4.2119 3.8956 3.3933 3.9633 4.4873 2.5207 2.5207 2.1921 2.0079 2.5766 3.2412 2.5804 3.2591 2.9607 2.1428 4.4673 2.7648 2.9319 3.7574 4.3369 3.3242 2.3887 3.6810 2.5793 2.4386 2.5136 4.6224 4.1816 4.1889 1.6985 1.6465 1.6935 2.0866 3.3776 2.2861 2.4861 3.4429 3.2747 2.2459 2.1973 2.1340 2.2234 2.1545 2.1279 2.0521 2.1777 2.2771 3.2930 4.1691 4.0753 2.0652 2.2130 2.1951 5.0216 2.3173 3.4124 1.0721 1.1023 1.4300 1.1850 1.2898 1.4701 1.4459 1.2733 1.2171 1.2942 1.2760 1.3934 1.2390 1.2287 1.2274 1.2253 1.2284 1.3151 1.3085 1.2401 1.3138 1.2651 1.2624 1.2861 1.0837 1.0837 1.0948 1.0969 1.0815 1.0869 1.0827 1.0896 1.0848 1.0883 1.0798 1.0800 1.0696 1.0689 1.0677 1.0673 1.0683 1.0674 1.0662 1.0664 1.0665 1.0658 1.0655 1.0646 1.0965 1.0943 1.0938 1.0911 1.0935 1.1000 1.0905 1.0966 1.0957 1.0954 1.0978 1.0972
irintensity: 0.9241 0.1366 0.4146 0.5610 0.7028 1.0761 2.9181 3.8205 5.7078 9.5063 0.7151 4.1354 1.9275 14.2027 3.2702 3.3890 7.8548 4.1381 1.6063 17.4179 10.9159 4.6473 17.4848 0.7007 1.4325 3.7984 6.8473 0.9022 0.7707 6.2624 6.0100 42.8114 20.8169 11.4122 13.8692 6.1033 1.7424 0.0741 3.4806 10.6351 173.3946 24.2136 27.9538 264.8388 34.2108 10.1048 16.8495 12.9827 2.6877 17.9983 22.6215 32.4477 14.6684 5.5133 15.1069 71.0483 43.6129 9.4325 10.5658 13.5897 20.4406 7.0703 19.4014 1.1383 1.1182 8.4477 9.6812 22.7888 12.9546 96.1817 5.6503 1.9641 1.5482 4.5339 1.4289 1.6083 1.9285 3.6550 6.1921 3.9883 7.9523 1.5084 10.5593 0.8715 2.7884 0.3823 0.1554 2.5789 2.7883 16.0452 18.7490 4.2775 10.8228 1.4049 7.2833 5.0836 5.6731 5.6816 4.9439 45.9792 120.1273 27.0352 53.7104 98.2453 15.4093 37.3809 41.3606 105.9332 113.0503 101.3061 58.8257 22.7055 44.6727 29.7132 24.1081 15.5935 53.9423 18.9249 40.1776 39.8930 42.4140 69.9738 27.8101
temp: 298.150 k
press: 1.00000 atm
elementType: 15 8 8 8 7 7 7 6 6 6 6 6 6 6 6 6 6 6 6 1 1 1 1 1 1 1 1 1 1 1 1 1 1 1 1 1 1 1 1 1 1 1 1
symmnumber: 1
zpe: 959054.1 jmol-1
zpe.correction: 0.365284 hartree
zpe.thermalcorrener: 0.384795 hartree
zpe.thermalcorrenthalpy: 0.385740 hartree
zpe.thermalcorrgfe: 0.316425 hartree
zpe.sumelectzpe: -1201.209890 hartree
zpe.sumelectthermal: -1201.190379 hartree
zpe.sumelectthermalent: -1201.189435 hartree
zpe.sumelectthermalfe: -1201.258750 hartree
dipole: 0.2000 -0.3408 -1.1813
dipole: 1.2456
quadrupole: -134.2146 -136.2816 -119.7917
quadrupole: 1.6825 -1.4218 7.9534
quadrupole: -4.1186 -6.1856 10.3043 1.6825 -1.4218 7.9534
hfenergy: -1201.5751743 hartree
pointgroup: C01 [X(C12H24N3O3P1)]
dipole: 0.1311886 -0.0617003 0.4681259 debye
polarizability: 190.3309124|-0.8885482|201.5558048|6.9579288|0.6271114|151.467937 unknown
InChI: InChI=1S/C12H24N3O3P/c1-7-16-8-2-13(1)19(14-3-9-17-10-4-14)15-5-11-18-12-6-15/h1-12H2
charge 0 multiplicity 1
43 atoms
P  0.267745 -0.026262 1.220219
O  2.181668 -3.802345 -0.881951
O  -4.181862 0.185641 -0.289872
O  1.962501 3.882223 -0.681487
N  0.818919 -1.505165 0.395671
N  -1.374375 0.068806 0.392833
N  0.930987 1.41754 0.39644
C  0.791308 -1.726088 -1.071865
C  1.532673 -2.541065 1.183174
C  -2.165641 1.303737 0.644168
C  -2.240586 -1.130822 0.537472
C  2.10251 2.075794 1.017875
C  0.822477 1.702898 -1.052773
C  0.910806 -3.228208 -1.372741
C  2.676506 -3.145968 0.350957
C  -3.314838 1.373085 -0.377483
C  -3.386834 -1.03869 -0.485742
C  2.034159 3.593418 0.762139
C  0.782677 3.226257 -1.273948
H  1.62488 -1.192152 -1.577793
H  -0.156791 -1.330787 -1.485007
H  0.848967 -3.359827 1.497095
H  1.942532 -2.08809 2.106318
H  -1.507152 2.18393 0.541271
H  -2.596658 1.310473 1.67323
H  -2.677005 -1.202294 1.561797
H  -1.639015 -2.039562 0.355062
H  3.055983 1.685702 0.593935
H  2.101935 1.873985 2.106106
H  -0.099213 1.231126 -1.438774
H  1.695896 1.286657 -1.604403
H  0.055313 -3.772002 -0.917872
H  0.906907 -3.411185 -2.46134
H  3.401338 -2.351174 0.077382
H  3.204332 -3.932742 0.918494
H  -3.976774 2.232304 -0.177014
H  -2.893557 1.45524 -1.403766
H  -2.965416 -1.051778 -1.515234
H  -4.100395 -1.871151 -0.364801
H  1.142974 4.017296 1.274819
H  2.946243 4.102524 1.116515
H  0.819981 3.477401 -2.347564
H  -0.142904 3.649518 -0.824341
