program: Gaussian 09
title: 000260925
version: EM64L-G09RevD.01
frameworkgroup: C1[X(C8H14O2)]
method: RPBEPBE
basis: SDD
operation: Freq
keyword: #pfreq=noraman
keyword: PBEPBE/SDD
title: #p freq=noraman PBEPBE/SDD
converged: YES YES NO NO
title: Mulliken charges:
elementType: O O C C C C C C C C H H H H H H H H H H H H H H
charge: -0.259663 -0.265489 -0.020308 -0.400058 -0.344766 -0.342901 -0.326340 -0.690593 -0.162506 -0.159222 0.204237 0.221510 0.205444 0.223119 0.191458 0.222488 0.212249 0.220886 0.209872 0.210023 0.209455 0.218025 0.211033 0.212046
chargesum: 0.00000
title: Mulliken charges with hydrogens summed into heavy atoms:
elementType: O O C C C C C C C C
charge: -0.259663 -0.265489 0.183930 0.026896 0.069811 0.091836 0.104418 -0.053089 0.048526 0.052824
polarizability: 1.09196487e+02 -3.60671815e+00 9.23682742e+01 -1.38403291e+00 -3.91365307e+00 6.79849006e+01
1716.lowfreq: -26.1325 -8.9747 -6.2062 0.0008 0.0008 0.0009 45.9120 74.9185 91.2080
frequency: 45.5825 74.7174 91.1575 145.2028 222.4204 239.4651 265.8286 281.8614 301.8412 354.0767 384.0130 480.1709 548.2201 623.0964 632.6138 712.7611 751.5044 799.3672 850.8790 884.7663 898.8412 911.1100 930.7123 950.0040 992.6133 998.8887 1013.2590 1053.1511 1066.6962 1090.7961 1119.0126 1144.1960 1209.5603 1218.3583 1227.7549 1232.8694 1262.6219 1282.0709 1318.0179 1332.8470 1345.8134 1352.0671 1360.2380 1374.6181 1391.4809 1446.3079 1447.7529 1459.8897 1477.0021 1477.6722 1488.3668 1680.5338 2946.2905 2962.3790 2964.2571 2971.8892 2975.3147 2992.4377 3025.3099 3051.9250 3052.3181 3054.4608 3071.6541 3073.1585 3093.6286 3125.8821
redmass: 3.2528 1.8264 2.7141 2.7639 1.6207 1.3946 3.5142 4.1778 4.2108 2.7460 3.2186 3.5140 2.6036 1.9627 1.9749 2.3017 1.4471 2.6791 3.4763 2.2661 2.1064 1.9083 2.7699 1.2823 2.9631 2.1519 2.1534 2.5490 3.3888 2.3796 2.2618 2.1119 1.0741 1.2140 1.2167 1.1553 1.2726 1.0931 1.2459 1.2570 1.3727 1.2139 1.6403 1.5329 1.2156 1.0855 1.0805 1.0814 1.0480 1.0444 1.0843 6.9750 1.0664 1.0787 1.0704 1.0364 1.0626 1.0603 1.0969 1.0948 1.1013 1.0964 1.1013 1.0992 1.0842 1.0991
irintensity: 1.0430 0.0102 1.9314 5.6049 1.1356 1.3726 6.4617 3.2789 7.6785 1.7014 1.2061 2.0142 12.1041 32.9920 25.7802 10.4724 18.3968 6.9802 9.8713 20.3247 0.5471 8.9939 43.2443 6.3218 38.8793 10.9865 12.3199 12.0203 79.5722 91.6680 23.3271 6.4548 0.4929 4.2325 7.7040 2.5417 1.9504 2.0877 13.8410 5.7749 2.7026 6.1777 19.7866 1.7357 8.4639 1.3295 11.1414 14.5645 4.5370 12.0838 16.2021 0.7723 49.3807 60.6721 20.2301 42.5590 18.5690 46.3537 1.0749 32.4540 9.9980 11.3042 96.2412 52.7134 11.2307 50.9873
temp: 298.150 k
press: 1.00000 atm
elementType: 8 8 6 6 6 6 6 6 6 6 1 1 1 1 1 1 1 1 1 1 1 1 1 1
symmnumber: 1
zpe: 541941.7 jmol-1
zpe.correction: 0.206415 hartree
zpe.thermalcorrener: 0.217060 hartree
zpe.thermalcorrenthalpy: 0.218004 hartree
zpe.thermalcorrgfe: 0.169922 hartree
zpe.sumelectzpe: -462.841645 hartree
zpe.sumelectthermal: -462.830999 hartree
zpe.sumelectthermalent: -462.830055 hartree
zpe.sumelectthermalfe: -462.878137 hartree
dipole: 0.5689 0.1817 -0.2115
dipole: 0.6336
quadrupole: -55.0328 -58.2003 -64.9569
quadrupole: -0.1127 -0.2694 -4.6380
quadrupole: 4.3639 1.1964 -5.5603 -0.1127 -0.2694 -4.6380
hfenergy: -463.0480597 hartree
pointgroup: C01 [X(C8H14O2)]
dipole: 0.2242598 -0.0652079 0.087148 debye
dipolederiv: -0.8174073 0.1779761 -0.0190483 0.2113746 -0.7796632 0.0438732 -0.1668584 0.0020441 -0.4156626 -1.0624042 -0.1132977 -0.0887401 -0.1420591 -0.6211912 0.00373 -0.0484584 -0.1074425 -0.3827898 1.0824572 -0.0353584 0.0626902 -0.0205189 0.9011783 0.0032561 0.0878361 0.1527725 0.5030555 -0.2155403 -0.0260293 0.0632534 -0.0437628 0.0700443 -0.0159943 0.1222969 -0.0432954 0.0037325 0.0696941 -0.0206586 0.0251445 0.0203503 0.1250191 -0.0385139 0.0845518 -0.0436636 0.0993403 0.4511179 -0.0720274 0.0603997 -0.1252529 0.3880044 -0.0641053 0.1995911 -0.0786556 0.3623465 0.5978369 0.0034851 -0.0224841 0.0145978 0.3301081 -0.0095831 -0.1283799 0.0064838 0.3349039 -0.0496385 -0.0200144 0.0419731 -0.0392132 0.0970997 0.0038705 0.0138615 0.0018637 0.0553344 0.0932737 0.0310789 0.02294 -0.0261845 -0.0588573 -0.0477747 0.0398449 -0.0249797 -0.2398643 -0.0013387 -0.092093 0.0776559 -0.0295096 -0.0162369 -0.0652915 0.075808 -0.0633974 -0.2281328 -0.0299259 0.018165 -0.0079252 0.0297783 -0.0469619 0.0828457 -0.0790354 0.0760746 -0.1547553 0.0346073 0.0604829 0.0067659 0.0467612 -0.1153613 -0.0686231 0.0013195 -0.055446 0.0694904 0.0610122 0.0113957 -0.0506793 0.0007671 0.0220609 0.1156108 -0.0611632 0.0786956 -0.0889018 0.0588714 0.0584729 0.036134 0.0350017 -0.1123077 -0.0810699 0.0171787 -0.0563744 0.044282 0.0260986 -0.0106024 -0.0097247 0.0094466 0.0011852 0.1381844 -0.0394001 0.1046395 -0.1297974 0.0376733 0.0049155 -0.0250134 0.0048772 -0.1530104 -0.021883 -0.0372626 -0.0487148 0.0799014 -0.0536007 -0.0504271 0.0953288 0.0342868 0.0889516 -0.0318692 0.0510188 0.0342197 -0.1122093 -0.0482108 -0.0842661 -0.0281195 -0.0852817 -0.0885647 -0.0439854 -0.0371819 -0.080311 0.07754 0.007805 0.0854234 -0.0564895 0.0181817 0.0440136 0.0238305 0.0614323 0.0924646 -0.1590242 0.0706711 0.0429545 -0.0474491 0.014208 0.0059602 0.1259983 0.0149512 0.1206553 -0.1027768 0.0550794 0.0357759 0.0316544 0.1019164 -0.1404757 -0.0869679 0.0576767 -0.0618858 0.0542245 -0.1422818 -0.0842957 -0.0779386 -0.1087673 0.0541492 -0.0513192 -0.1134072 -0.0594011 0.019541 -0.0541939 0.0935795 -0.0617796 0.09837 -0.0466381 0.0676696 -0.0780147 0.0510072 0.1448349 -0.171656 -0.0146352 -0.0285485 -0.0193676 0.0514936 0.0181112 -0.0382056 0.0026468 0.1653871 unknown
polarizability: 109.1871311|3.712704|91.7447214|1.019181|-5.5328908|68.617809 unknown
InChI: InChI=1S/C8H14O2/c1-2-5-8-9-6-3-4-7-10-8/h3-4,8H,2,5-7H2,1H3
charge 0 multiplicity 1
24 atoms
O  0.190593 -0.786872 -0.829087
O  0.660184 1.276194 0.344358
C  -0.310041 0.545022 -0.456694
C  -1.61221 0.515282 0.351184
C  -2.786361 -0.107582 -0.434366
C  0.869353 -1.524533 0.257245
C  2.017777 1.306055 -0.238718
C  -4.079172 -0.180673 0.405522
C  2.332915 -1.14465 0.388959
C  2.840255 0.089528 0.141242
H  -0.452285 1.024866 -1.449267
H  -1.853829 1.555602 0.642323
H  -1.440786 -0.044348 1.291678
H  -2.495928 -1.119544 -0.775628
H  -2.973465 0.488814 -1.350725
H  0.780608 -2.586684 -0.030576
H  0.336102 -1.383628 1.221031
H  2.483794 2.219357 0.171386
H  1.9527 1.414113 -1.343821
H  -3.930902 -0.803159 1.308205
H  -4.3953 0.825205 0.74123
H  -4.910895 -0.620334 -0.174745
H  3.015912 -1.952643 0.687589
H  3.922981 0.253113 0.238773
