program: Gaussian 09
title: 000260928
version: EM64L-G09RevD.01
frameworkgroup: C1[X(C9H10Cl2O)]
method: RPBEPBE
basis: SDD
operation: Freq
keyword: #p
keyword: freq=noraman
keyword: PBEPBE/SDD
title: #p freq=noraman PBEPBE/SDD
converged: YES YES NO NO
title: Mulliken charges:
elementType: Cl Cl O C C C C C C C C C H H H H H H H H H H
charge: -0.090299 -0.093356 -0.263314 0.424565 0.553815 0.211622 -0.488856 -0.364893 -0.342105 -0.755447 -0.778634 -0.533778 0.248437 0.239058 0.245376 0.262203 0.289635 0.265316 0.266434 0.222128 0.230582 0.251514
chargesum: 0.00000
title: Mulliken charges with hydrogens summed into heavy atoms:
elementType: Cl Cl O C C C C C C C C C
charge: -0.090299 -0.093356 -0.263314 0.424565 0.553815 0.211622 -0.240418 -0.125835 -0.096730 -0.203610 -0.246885 0.170446
polarizability: 1.67826960e+02 3.77842406e+00 1.25295733e+02 2.34636518e+00 2.03355877e+00 8.35875509e+01
1716.lowfreq: -4.5469 -2.2300 -0.0029 -0.0016 0.0009 10.7687 33.8878 39.7210 60.7480
frequency: 33.8803 39.6624 60.7474 98.3435 116.5916 167.1580 209.8148 235.0600 252.6893 269.1774 340.5977 366.6593 446.1120 462.2730 500.7457 534.6918 580.6954 595.1629 670.3659 713.3025 736.1256 764.7899 823.2116 892.6105 902.8817 918.0809 949.1907 963.5268 986.1894 1104.3488 1113.2614 1124.2981 1148.0141 1156.9754 1184.8850 1231.5323 1241.4413 1254.1453 1256.6069 1299.0443 1392.1783 1429.4924 1437.6166 1452.6240 1461.9109 1469.1187 1470.0244 1498.0397 1587.5614 1619.7789 2968.6318 3061.4058 3066.5528 3077.8545 3127.0330 3132.9148 3134.4594 3147.7111 3165.0087 3169.1096
redmass: 12.8917 5.4249 5.2659 5.6739 4.5900 4.1128 2.4701 1.3599 3.5279 3.1116 3.1748 4.7377 3.9380 4.3668 3.6413 6.0085 5.0460 6.6334 4.2790 4.7194 5.0845 3.8607 1.5205 1.5383 1.8345 1.5317 1.3640 2.5703 8.7191 1.4429 1.2588 1.1588 1.3080 1.3888 1.4694 1.9935 1.1598 1.4009 2.3990 1.6775 6.1233 2.8192 1.2367 1.2150 1.1438 1.0527 1.0976 2.5623 7.4687 6.4462 1.0327 1.1043 1.0576 1.0578 1.0921 1.0956 1.0943 1.1113 1.1110 1.0942
irintensity: 1.3963 0.0901 2.1235 3.6982 3.4342 7.8556 1.4388 1.0082 6.5938 0.1824 0.2962 4.9019 2.7039 21.5827 7.8010 77.2999 9.3017 99.9608 16.0006 4.0615 10.2379 8.3187 37.1224 0.9567 6.4930 8.8647 0.2005 5.7643 44.6945 29.3002 0.5643 5.7850 16.7932 45.1862 28.3487 74.8917 27.7987 18.1099 138.5325 20.4962 7.9077 4.0278 2.8455 12.5885 5.9075 17.8940 54.8331 62.1193 8.0269 89.2307 62.8676 38.4461 24.3664 19.7257 6.2962 24.7896 0.3852 6.2882 1.4634 11.4118
temp: 298.150 k
press: 1.00000 atm
elementType: 17 17 8 6 6 6 6 6 6 6 6 6 1 1 1 1 1 1 1 1 1 1
symmnumber: 1
zpe: 440309.0 jmol-1
zpe.correction: 0.167705 hartree
zpe.thermalcorrener: 0.180149 hartree
zpe.thermalcorrenthalpy: 0.181093 hartree
zpe.thermalcorrgfe: 0.126664 hartree
zpe.sumelectzpe: -1343.399024 hartree
zpe.sumelectthermal: -1343.386580 hartree
zpe.sumelectthermalent: -1343.385636 hartree
zpe.sumelectthermalfe: -1343.440065 hartree
dipole: -1.5489 -4.5433 2.6167
dipole: 5.4670
quadrupole: -88.2964 -78.2732 -83.7861
quadrupole: 6.8611 5.8560 7.7303
quadrupole: -4.8445 5.1787 -0.3342 6.8611 5.8560 7.7303
hfenergy: -1343.566729 hartree
pointgroup: C01 [X(C9H10Cl2O1)]
dipole: 0.669782 1.5081417 1.3795692 debye
dipolederiv: -0.2916335 0.194228 0.0571452 0.2267017 -0.51759 -0.1222527 0.2544361 -0.4187094 -0.4200192 -0.6887304 -0.0525923 -0.1600175 -0.1383638 -0.1959968 -0.055684 -0.6472107 -0.0880662 -0.4985556 -1.6522659 -0.609818 0.0061409 -0.3461469 -0.4641785 0.025955 0.0819839 0.0420224 -0.2823026 -0.4211095 0.087025 -0.0150357 -0.2346257 -0.1862327 -0.0231019 -0.0285224 0.1302061 -0.1260267 -0.414208 -0.0419866 -0.0303039 0.0368373 -0.2732431 -0.0072409 0.1874174 0.0483988 -0.1098768 1.4663799 0.4922475 0.0105514 0.0020365 0.0836267 0.0095799 -0.0237811 0.0042825 0.0949041 0.2543526 -0.0993158 0.0038457 -0.067522 0.0946983 -0.0664063 0.005963 -0.0224268 -0.1208365 0.204839 0.1433232 0.012872 0.0816596 0.1604825 -0.0263992 -0.0145938 -0.0743914 -0.120258 -0.4861032 -0.1040243 -0.0209526 0.3170426 0.0402306 -0.0098369 -0.0610178 -0.0384875 -0.1721063 0.3184298 -0.3342397 -0.117704 -0.3059447 0.6747019 0.1936946 -0.221789 0.3660334 0.5415439 1.0195072 0.0955882 0.2720472 0.1675102 0.1847779 0.0889295 0.5597833 0.1077235 0.623383 0.5331727 0.2264107 -0.0167111 0.5171437 0.5691413 -0.0080667 -0.1061715 -0.049179 0.3123779 0.0647874 -0.0645349 0.0135199 -0.0635837 -0.0420663 0.0334091 0.009616 0.0247707 0.1220383 0.0137561 0.0971742 -0.003531 0.0851613 -0.014279 0.0248739 -0.0124813 0.0248497 0.1350804 0.0465456 -0.0815262 0.0119075 -0.0785833 -0.0478653 0.0295497 0.0190088 0.0360644 0.1583469 0.0450584 -0.0699091 0.0994296 0.0124496 -0.0433816 0.0236638 0.0671413 0.00006 -0.0408249 -0.0198069 0.0437548 -0.0422256 -0.0180064 0.0732826 -0.0768603 -0.0057243 -0.0789212 -0.0019446 -0.0095917 0.0145669 -0.0236442 0.0930388 -0.034861 -0.0877708 -0.0603087 -0.0569743 -0.0160994 0.0198069 -0.0121312 -0.0386924 -0.0994073 -0.0100824 0.0771651 -0.0367054 0.0491964 -0.0549796 0.0678555 0.0572253 0.0693366 -0.1171409 -0.1053085 -0.0900525 0.0329106 -0.1064429 -0.0477178 0.0661092 0.0346747 -0.0917027 -0.1132257 -0.0281415 0.0615977 0.0003651 0.0938786 -0.0991292 -0.137151 -0.0161401 0.0037248 0.0429695 0.082285 0.0052539 -0.0003193 0.0061122 0.1230028 unknown
polarizability: 167.8838371|-0.9229118|124.3491088|5.36164|5.3069304|84.4772979 unknown
InChI: InChI=1S/C9H10Cl2O/c1-12-9-3-2-7(5-10)4-8(9)6-11/h2-4H,5-6H2,1H3
charge 0 multiplicity 1
22 atoms
Cl 1.842073 -2.832919 -0.948087
Cl -3.9232 -0.210798 -1.245688
O  2.55297 0.522216 0.293001
C  0.575443 -0.792542 0.556971
C  -1.671959 0.237559 0.439421
C  1.157564 0.492356 0.323586
C  -0.831163 -0.891946 0.606286
C  -1.065494 1.497607 0.207889
C  0.335452 1.633192 0.150261
C  1.443127 -1.996033 0.740024
C  -3.159164 0.103343 0.501138
C  3.213078 1.801903 0.012552
H  -1.281547 -1.879182 0.768319
H  -1.69764 2.382011 0.065744
H  0.774349 2.618886 -0.027578
H  0.950633 -2.793349 1.313403
H  2.43344 -1.753079 1.144731
H  -3.666694 1.019416 0.83467
H  -3.49535 -0.765359 1.084401
H  2.984911 2.550457 0.795429
H  2.917005 2.191716 -0.979497
H  4.288364 1.573544 0.016621
